{"text_format":"1","workbook":"xlsx","n_sheets":6,"sheets":["Submittal","Sheet1","REVISION","SUBMITTAL DATA","All Temp Options","Pics"],"not_rendered":{"charts":0,"images":17,"macros":1,"external_links":0,"defined_names":20,"comments":0,"pivot_tables":0},"unopened":[],"bounds":{"document_bytes":16777216,"sheet_cells":100000,"rows_first":2000,"rows_last":500,"rows_between":2000,"halvings":0,"cell_chars":16384,"cell_head_chars":4096},"cells_cut":0,"cells_raw":0,"read":"whole","date_system":"1900"}

{"sheet":"Submittal","index":0,"n_rows":98,"n_cols":41,"rows_kept":98,"cut":false,"hidden":false,"merged":[[71,16,71,17],[5,11,5,13],[5,0,5,7],[6,0,6,4],[7,0,7,4],[8,0,8,4],[6,11,6,13],[7,11,7,13],[8,11,8,13],[6,5,6,7],[7,5,7,7],[6,8,6,10],[7,8,7,10],[8,8,8,10],[8,5,8,7],[14,0,14,13],[10,5,10,7],[13,12,13,13],[12,5,12,7],[13,5,13,7],[9,11,9,13],[9,5,9,7],[10,11,10,13],[10,8,10,10],[12,10,12,11],[13,10,13,11],[9,8,9,10],[12,2,12,3],[13,2,13,3],[11,0,11,13],[12,0,12,1],[12,12,12,13],[13,0,13,1],[4,6,4,10],[4,12,4,13],[0,0,4,5],[0,6,0,10],[0,11,0,13],[1,6,1,10],[1,11,1,13],[2,6,2,10],[2,11,2,13],[3,6,3,10],[3,12,3,13],[5,8,5,10],[9,0,9,4],[15,0,29,13],[31,0,32,1],[33,0,33,1],[31,7,32,7],[31,6,32,6],[31,2,32,2],[31,8,32,8],[31,3,31,5],[31,9,32,9],[31,10,32,10],[31,11,32,11],[30,2,30,11],[30,13,32,13],[10,0,10,4],[43,0,43,13],[40,8,40,13],[41,8,41,13],[42,8,42,13],[40,6,42,7],[40,0,40,5],[41,0,41,5],[42,0,42,5],[39,0,39,13],[37,0,37,1],[35,0,36,1],[35,9,36,9],[35,10,36,10],[35,11,36,11],[35,12,36,12],[80,15,87,15],[3,17,3,30],[34,0,34,11],[49,0,49,1],[35,2,36,3],[37,2,37,3],[35,8,36,8],[35,6,36,7],[37,6,37,7],[35,4,36,4],[35,5,36,5],[38,0,38,13],[48,0,48,8],[44,0,44,13],[45,0,47,13],[50,0,50,1]]}
[null,null,null,null,null,null,"HEAT TRANSFER PRODUCTS GROUP, LLC",null,null,null,null,"SUBMITTAL DATA SHEET"]
[null,null,null,null,null,null,"3885 Crestwood Parkway / Suite 500",null,null,null,null,"HEAVY DUTY (W)",null,null,null,null,null,"HIGH STATIC",true]
[null,null,null,null,null,null,"Duluth, GA  30096",null,null,null,null,"UNIT COOLER"]
[null,null,null,null,null,null,"(P) 800-288-9488 / (F) 256-259-7478",null,null,null,null,null,"For Record Only",null,null,null,null,"T5 IS TEST FOR HIGH STATIC BECAUSE I WAS HAVING TROUBLE WITH DROP LIST SELECTION BEING STATIC AND CHANGING OPTOIN AND GETTING A FALSE VALID SELECTION"]
[null,null,null,null,null,null,"https://www.htpg.com/",null,null,null,null,null,"For Approval",null,null,null,null,null,null,{"$f":"IF(AND(T95>=1,'All Temp Options'!C21=\"\"),FALSE,TRUE)","v":true}]
[{"$f":"\"Rev. \"","v":"Rev. "},null,null,null,null,null,null,null,null,null,null,null,null,null,null,null,null,null,null,{"$f":"IF(T5=FALSE,FALSE,IF(T95=0,\"T\",\"H\"))","v":"T"}]
["Job Name:",null,null,null,null,null,null,null,"Job Location:"]
["Customer Name:"]
["Architect / Engineer:",null,null,null,null,null,null,null,"Prepared By:"]
["Unit Model Number:",null,null,null,null,{"$f":"IFERROR(R41,\"\")","v":""},null,null,"Tagging Info:"]
["Unit Quantity:",null,null,null,null,null,null,null,"Date:",null,null,{"$f":"TODAY()","v":"2024-07-31"}]
["Select unit attributes from the application option above and the drop down menus below to build required model number"]
["Brand",null,"Motor Type",null,"FPI","Defrost Type",null,null,"SST","Refrig.",{"$f":"\"R-\"&J14&\" Adjusted Capacity (BTUH) @ 10F TD\"","v":"R- Adjusted Capacity (BTUH) @ 10F TD"},null,"Unit Voltage"]
[]
["**clear all  fields when starting over**",null,null,null,null,null,null,null,null,null,null,null,null,null,null,null,"Russell","R","Dual Speed ECM","D",null,null,null,{"$f":"IF(OR(E14=\"\",E14=6),\"Air\",\"\")","v":"Air"},"A",4,null,"404A","A",null,{"$f":"IF(OR(F14=\"Electric- Medium Temperature\",F14=\"Electric- Low Temperature\"),\"208-230/3/60\",\"\")","v":""},"E"]
[null,null,null,null,null,null,null,null,null,null,null,null,null,null,null,null,"Witt","W"," "," ",null,null,null,{"$f":"IF(E14=6,\"Electric- Medium Temperature\",\"\")","v":""},"D",6,null,"407A","E",null,{"$f":"IF(OR(F14=\"AIR\",F14=\"Hot Gas - 3 Pipe - Elec. Drain Pan\",F14=\"Hot Gas - 3 Pipe - H.G. Drain Pain\",F14=\"Hot Gas - Reverse Cycle - Elec. Drain Pan\",F14=\"Hot Gas - Reverse Cycle - H.G. Drain Pain\",F14=\"Thermobank\"),\"208-230/1/60\",\"\")","v":""},"D"]
[null,null,null,null,null,null,null,null,null,null,null,null,null,null,null,null,"Kramer","K"," "," ",null,null,null,"Electric- Low Temperature","E",null,null,"448A","E",null,{"$f":"IF(OR(F14=\"Electric- Medium Temperature\",F14=\"Electric- Low Temperature\"),\"460/3/60\",\"\")","v":""},"G"]
[null,null,null,null,null,null,null,null,null,null,null,null,null,null,null,null,"ColdZone","C",null,null,null,null,null,"Hot Gas - 3 Pipe - Elec. Drain Pan","H",null,null,"449A","E",null,{"$f":"IF(OR(F14=\"AIR\",F14=\"Hot Gas - 3 Pipe - Elec. Drain Pan\",F14=\"Hot Gas - 3 Pipe - H.G. Drain Pain\",F14=\"Hot Gas - Reverse Cycle - Elec. Drain Pan\",F14=\"Hot Gas - Reverse Cycle - H.G. Drain Pain\",F14=\"Thermobank\"),\"460/1/60\",\"\")","v":""},"F",null,null," "]
[null,null,null,null,null,null,null,null,null,null,null,null,null,null,null,null,null,null,null,null,null,null,null,"Hot Gas - 3 Pipe - H.G. Drain Pain","K",null,null,"449B","E",null,{"$f":"IF(OR(F14=\"Electric- Medium Temperature\",F14=\"Electric- Low Temperature\"),\"575/3/60\",\"\")","v":""},"J"]
[null,null,null,null,null,null,null,null,null,null,null,null,null,null,null,null,null,null,null,null,null,null,null,"Hot Gas - Reverse Cycle - Elec. Drain Pan","G",null,null,null,null,null,{"$f":"IF(OR(F14=\"AIR\",F14=\"Hot Gas - 3 Pipe - Elec. Drain Pan\",F14=\"Hot Gas - 3 Pipe - H.G. Drain Pain\",F14=\"Hot Gas - Reverse Cycle - Elec. Drain Pan\",F14=\"Hot Gas - Reverse Cycle - H.G. Drain Pain\",F14=\"Thermobank\"),\"575/1/60\",\"\")","v":""},"H"]
[null,null,null,null,null,null,null,null,null,null,null,null,null,null,null,null,null,null,null,null,null,null,null,"Hot Gas - Reverse Cycle - H.G. Drain Pain","L"]
[null,null,null,null,null,null,null,null,null,null,null,null,null,null,null,null,null,null,null,null,null,null,null,{"$f":"IF(A14=\"KRAMER\",\"Thermobank\",\"\")","v":""},"T"]
[null,null,null,null,null,null,null,null,null,null,null,null,null,null,null,null,null,null,null,null,null,null,null,{"$f":"IF(A14=\"KRAMER\",\"Thermobank-Medium Temperature\",\"\")","v":""},"S"]
[null,null,null,null,null,null,null,null,null,null,null,null,null,null,null,null,null,null,null,null,null,null,null,"Hot Gas - 3 Pipe - Elec. Drain Pan MT","B"]
[null,null,null,null,null,null,null,null,null,null,null,null,null,null,null,null,null,null,null,null,null,null,null,"Hot Gas - 3 Pipe - H.G. Drain Pain MT","C"]
[null,null,null,null,null,null,null,null,null,null,null,null,null,null,null,null,null,null,null,null,null,null,null,"Hot Gas - Reverse Cycle - Elec. Drain Pan MT","M"]
[null,null,null,null,null,null,null,null,null,null,null,null,null,null,null,null,null,null,null,null,null,null,null,"Hot Gas - Reverse Cycle - H.G. Drain Pain MT","N",null,null,"shows 744 in list","No"]
[]
[]
[]
[null,null,"Physical Data",null,null,null,null,null,null,null,null,null,null,{"$f":"IF(I14=\"\",\"AWEF\",(IF(OR(I14=25,I14=20,I14=15,I14=10),\"AWEF COOLER\",\"AWEF FREEZER\")))","v":"AWEF"}]
["Base Model",null,"Fins/Inch","Refrig. Conn (ODS)",null,null,"Net Weight","Ship Weight ","Number of Fans","Air Throw","CFM","Fan Diameter"]
[null,null,null,"Liquid","Suction","Hot Gas"]
[{"$f":"IFERROR(\"W\"&E14&S38&T38,\"\")","v":""},null,{"$f":"IF(E14=0,\"\",E14)","v":""},{"$f":"IFERROR(VLOOKUP(S41,'SUBMITTAL DATA'!A2:AD1000,20,FALSE),\"\")","v":""},{"$f":"IFERROR(VLOOKUP(S41,'SUBMITTAL DATA'!A2:AD250,21,FALSE),\"\")","v":""},{"$f":"IFERROR(VLOOKUP(S41,'SUBMITTAL DATA'!A2:AD250,22,FALSE),\"\")","v":""},{"$f":"IFERROR(VLOOKUP(S41,'SUBMITTAL DATA'!A2:AD250,27,FALSE),\"\")","v":""},{"$f":"IFERROR(VLOOKUP(S41,'SUBMITTAL DATA'!A2:AD250,28,FALSE),\"\")","v":""},{"$f":"IFERROR(VLOOKUP(S41,'SUBMITTAL DATA'!A2:AD250,4,FALSE),\"\")","v":""},{"$f":"IF(F10=\"\",\"\",\"100'\")","v":""},{"$f":"IFERROR(VLOOKUP(S41,'SUBMITTAL DATA'!A2:AD250,12,FALSE),\"\")","v":""},{"$f":"IF(F10=\"\",\"\",\"30\"\"\")","v":""},null,{"$f":"IF(I14=\"\",\"0\",IF(OR(I14=25,I14=20,I14=15,I14=10),\"9.0\",\"4.15\"))","v":"0"}]
["Electrical Data"]
["Motor Voltage",null,"Total Motor Amps",null,{"$f":"IF(Q68>=1,\"EcoNet MCA\",\"Motor Circuit MCA\")","v":"Motor Circuit MCA"},{"$f":"IF(Q68>=1,\"EcoNet MOPD\",\"Motor Circuit MOPD\")","v":"Motor Circuit MOPD"},"Heater Voltage",null,"Number of Heater Circuits","Heater Amps Each Circuit","Total Heater Amps","Heater Watts"]
[null,null,null,null,null,null,null,null,null,null,null,null,null,null,null,null,"Brand",{"$f":"Submittal!A14","v":0},"Defrost","Capacity",null,"Voltage","Motor","Refrigerant"]
[{"$f":"IFERROR(VLOOKUP(S41,'SUBMITTAL DATA'!A2:AD250,13,FALSE),\"\")","v":""},null,{"$f":"IFERROR(VLOOKUP(S41,'SUBMITTAL DATA'!A2:AD250,14,FALSE),\"\")","v":""},null,{"$f":"IFERROR(VLOOKUP(S41,'SUBMITTAL DATA'!A2:AD250,IF(Q68>=1,25,23),FALSE),\"\")","v":""},{"$f":"IFERROR(VLOOKUP(S41,'SUBMITTAL DATA'!A2:AD250,IF(Q68>=1,26,24),FALSE),\"\")","v":""},{"$f":"IFERROR(VLOOKUP(S41,'SUBMITTAL DATA'!A2:AD250,15,FALSE),\"\")","v":""},null,{"$f":"IFERROR(VLOOKUP(S41,'SUBMITTAL DATA'!A2:AD250,16,FALSE),\"\")","v":""},{"$f":"IFERROR(VLOOKUP(S41,'SUBMITTAL DATA'!A2:AD250,18,FALSE),\"\")","v":""},{"$f":"IFERROR(VLOOKUP(S41,'SUBMITTAL DATA'!A2:AD250,18,FALSE),\"\")","v":""},{"$f":"IFERROR(VLOOKUP(S41,'SUBMITTAL DATA'!A2:AD250,19,FALSE),\"\")","v":""},null,null,null,null," ",{"$f":"VLOOKUP(R37,Q15:R18,2,FALSE)","v":{"$error":"#N/A"}},{"$f":"VLOOKUP(F14,X15:Y22,2,FALSE)","v":{"$error":"#N/A"}},{"$f":"IF(T39<100000,\"0\"&LEFT(T39,LEN(T39)-3),LEFT(T39,LEN(T39)-3))","v":{"$error":"#N/A"}},null,{"$f":"VLOOKUP(M14,AE15:AF21,2,FALSE)","v":{"$error":"#N/A"}},{"$f":"VLOOKUP(C14,S15:T16,2,FALSE)","v":{"$error":"#N/A"}},{"$f":"VLOOKUP($J$14,AB15:AC19,2,FALSE)","v":{"$error":"#N/A"}}]
[" ",null,null,null,null,null,null,null,null,null,null,null,null,null,null,null,null,null,null,{"$f":"R60","v":{"$error":"#N/A"}}]
["Options (Select catalog options from drop down menu.)",null,null,null,null,null,null,null,null,null,null,null,null,null,null,null,null,"Unit Model Num.","Lookup",null,null,null,null,"Temperature"]
[null,null,null,null,null,null,{"$f":"IF(U68=1,\"CONFIGURATION CONFLICT\",\"\")","v":""},null,null,null,null,null,null,null,null,null,null,{"$f":"R38&\"H\"&E14&S38&T38&V38&W38&\"A\"","v":{"$error":"#N/A"}},{"$f":"\"H\"&E14&S38&T38&V38&W38&\"A\"","v":{"$error":"#N/A"}},null,null,null,null,{"$f":"VLOOKUP(S41,'SUBMITTAL DATA'!A2:AD21,9,FALSE)","v":{"$error":"#N/A"}}]
[null,null,null,null,null,null,null,null,null,null,null,null,null,null,null,null,"HG CAP TABLE IF SELECTED","404a CAP TABLE",null,"404 / 744",null,null,null,null,null,null,"HG refrigerants",null,null,null,null,null,null,"404/744","HG"]
[null,null,null,null,null,null,null,null,null,null,null,null,null,null,null,null,null,null,null,"L4E","L6E","M6A","L4P","L6P","L4R","L6R","4E","6E","6A","4P","6P","4R","6R","M6E","M6E"]
[null,null,null,null,null,null,null,null,null,null,null,null,null,null,null,1,{"$f":"ROUND((VLOOKUP(P44,$S$44:$AI$61,$R$97,FALSE)*100)*IF($U$91=1,VLOOKUP($I$14,$X$74:$Y$82,2,FALSE),1),0)","v":{"$error":"#REF!"}},{"$f":"VLOOKUP(P44,$S$44:$AI$60,$U$81,FALSE)*100","v":{"$error":"#REF!"}},1,358,331,312,358,331,358,331,411,387,366,411,387,411,387,302,366,null,null,null,null,null,366]
["Additional Requirements",null,null,null,null,null,null,null,null,null,null,null,null,null,null,2,{"$f":"ROUND((VLOOKUP(P45,$S$44:$AI$61,$R$97,FALSE)*100)*IF($U$91=1,VLOOKUP($I$14,$X$74:$Y$82,2,FALSE),1),0)","v":{"$error":"#REF!"}},{"$f":"VLOOKUP(P45,$S$44:$AI$61,$U$81,FALSE)*100","v":{"$error":"#REF!"}},2,440,445,436,440,445,440,445,508,509,511,508,509,508,509,426,511,null,null,null,null,null,511]
[null,null,null,null,null,null,null,null,null,null,null,null,null,null,null,3,{"$error":"#REF!"},{"$error":"#REF!"},3,714,538,521,714,538,714,538,830,621,619,830,621,830,621,511,619,null,null,null,null,null,619]
[null,null,null,null,null,null,null,null,null,null,null,null,null,null,null,4,{"$error":"#REF!"},{"$error":"#REF!"},4,874,664,632,874,664,874,664,1009,766,735,1009,766,1009,766,620,735,null,null,null,null,null,735]
[null,null,null,null,null,null,null,null,null,null,null,null,null,null,null,5,{"$error":"#REF!"},{"$error":"#REF!"},5,1077,894,879,1077,894,1077,894,1229,1023,1035,1229,1023,1229,1023,869,1035,null,null,null,null,null,1035]
["Capacity Correction for Electric & Hot Gas Defrost Evaporators",null,null,null,null,null,null,null,null,null,null,null,null,null,null,6,{"$f":"ROUND((VLOOKUP(P49,$S$44:$AI$61,$R$97,FALSE)*100)*IF($U$91=1,VLOOKUP($I$14,$X$74:$Y$82,2,FALSE),1),0)","v":{"$error":"#REF!"}},{"$error":"#REF!"},6,1319,1092,1052,1319,1092,1319,1092,1523,1257,1249,1523,1257,1523,1257,1040,1249,null,null,null,null,null,1249]
["S.S.T. (Dew)",null,"25°F","20°F","0°F","-10°F","-20°F","-30°F","-40°F",null,null,null,null,null,null,7,{"$f":"ROUND((VLOOKUP(P50,$S$44:$AI$61,$R$97,FALSE)*100)*IF($U$91=1,VLOOKUP($I$14,$X$74:$Y$82,2,FALSE),1),0)","v":{"$error":"#REF!"}},{"$error":"#REF!"},7,1670,1345,1325,1670,1345,1670,1345,1902,1538,1558,1902,1538,1902,1538,1300,1558,null,null,null,null,null,1558]
["Multiply Capacity by:",null,1.16875,1.1499999999999999,1.075,1.0375000000000001,1,0.96250000000000002,0.92500000000000004,null,null,null,null,null,null,8,{"$f":"ROUND((VLOOKUP(P51,$S$44:$AI$61,$R$97,FALSE)*100)*IF($U$91=1,VLOOKUP($I$14,$X$74:$Y$82,2,FALSE),1),0)","v":{"$error":"#REF!"}},{"$error":"#REF!"},8,null,1635,"1563",null,1635,null,1635,null,"1888","1857",null,"1888",null,"1888","1550","1857",null,null,null,null,null,"1857"]
[null,null,null,null,null,null,null,null,null,null,null,null,null,null,null,9,{"$f":"ROUND((VLOOKUP(P52,$S$44:$AI$61,$R$97,FALSE)*100)*IF($U$91=1,VLOOKUP($I$14,$X$74:$Y$82,2,FALSE),1),0)","v":{"$error":"#REF!"}},{"$error":"#REF!"},9,null,1991,"1754",null,1991,null,1991,null,"2274","2069",null,"2274",null,"2274","1740","2069",null,null,null,null,null,"2069"]
[null,null,null,null,null,null,null,null,null,null,null,null,null,null,null,10,{"$f":"ROUND((VLOOKUP(P53,$S$44:$AI$61,$R$97,FALSE)*100)*IF($U$91=1,VLOOKUP($I$14,$X$74:$Y$82,2,FALSE),1),0)","v":{"$error":"#REF!"}},{"$error":"#REF!"},10,null,null,"2095",null,null,null,null,null,null,"2531",null,null,null,null,"2085","2531",null,null,null,null,null,"2531"]
[null,null,null,null,null,null,null,null,null,null,null,null,null,null,null,11,{"$f":"ROUND((VLOOKUP(P55,$S$44:$AI$61,$R$97,FALSE)*100)*IF($U$91=1,VLOOKUP($I$14,$X$74:$Y$82,2,FALSE),1),0)","v":{"$error":"#REF!"}},{"$error":"#REF!"},11]
[null,null,null,null,null,null,null,null,null,null,null,null,null,null,null,12,{"$error":"#REF!"},{"$error":"#REF!"},12]
[null,null,null,null,null,null,null,null,null,null,null,null,null,null,null,13,{"$error":"#REF!"},{"$error":"#REF!"},13]
[null,null,null,null,null,null,null,null,null,null,null,null,null,null,null,14,{"$error":"#REF!"},{"$error":"#REF!"},14]
[null,null,null,null,null,null,null,null,null,null,null,null,null,null,null,15,{"$error":"#REF!"},{"$error":"#REF!"},15]
[null,null,null,null,null,null,null,null,null,null,null,null,null,null,null,16,{"$error":"#N/A"},{"$error":"#REF!"},16]
[null,null,null,null,null,null,null,null,null,null,null,null,null,null,null,null,null,{"$f":"VLOOKUP(K14,$Q$44:$R$59,2,FALSE)","v":{"$error":"#N/A"}}]
[null,null,null,null,null,null,null,null,null,null,null,null,null,null,null,null,null,null,1,2,3,4,5,6,7,8,9,10,11,12,13,14,15,16,17]
[null,null,null,null,null,null,null,null,null,null,null,null,null,null,null,null,null,null,null,"ED","ED","AIR","HG ED","HG ED","HG ED","HG ED","ED","ED","AIR","HG ED","HG ED","HG ED","HG ED","ED","ED"]
[null,null,null,null,null,null,null,null,null,null,null,null,null,null,null,null,null,null,null,"LOW","LOW",null,"HGLOOP","HGLOOP","HGLOOP","HGLOOP","LOW","LOW",null,"HGLOOP","HGLOOP","HGLOOP","HGLOOP","MED","MED"]
[null,null,null,null,null,null,null,null,null,null,null,null,null,null,null,null,null,null,null,404,404,404,404,404,404,404,448,448,448,448,448,448,448,404,448]
[null,null,null,null,null,null,null,null,null,null,null,null,null,null,null,null,null,null,null,null," "," "," "," "," "," "," "]
[]
[null,null,null,null,null,null,null,null,null,null,null,null,null,null,null,null,"FOR ECONET ELECTRICAL",null,null,"FOR SHEET ERRORS",null,null,null,null,null,null," "]
[null,null,null,null,null,null,null,null,null,null,null,null,null,null,null,null,{"$f":"SUM(Q69:R71)","v":0},null,null,{"$f":"SUM(T69:U71)","v":0},{"$f":"IF(AND(Q68>0,T68>0),1,0)","v":0},null,null,null,null,null," "]
[null,null,null,null,null,null,null,null,null,null,null,null,null,null,null,null,{"$f":"IF(A41=\"EcoNet\",1,0)","v":0},{"$f":"IF(I41=\"EcoNet\",1,0)","v":0},null,{"$f":"IF(A41=\"Thermostatic Expansion Valve - Mounted\",1,IF(A41=\"Electronic Expansion Valve - Mounted\",1,IF(A41=\"Liquid Line Solenoid Valve - Mounted\",1,IF(A41=\"Mechanical Thermostat - Mounted\",1,IF(A41=\"Electronic Room Thermostat - Mounted\",1,0)))))","v":0},{"$f":"IF(I41=\"Thermostatic Expansion Valve - Mounted\",1,IF(I41=\"Electronic Expansion Valve - Mounted\",1,IF(I41=\"Liquid Line Solenoid Valve - Mounted\",1,IF(I41=\"Mechanical Thermostat - Mounted\",1,IF(I41=\"Electronic Room Thermostat - Mounted\",1,0)))))","v":0}]
[null,null,null,null,null,null,null,null,null,null,null,null,null,null,null,null,{"$f":"IF(A42=\"EcoNet\",1,0)","v":0},{"$f":"IF(C42=\"EcoNet\",1,0)","v":0},null,{"$f":"IF(A42=\"Thermostatic Expansion Valve - Mounted\",1,IF(A42=\"Electronic Expansion Valve - Mounted\",1,IF(A42=\"Liquid Line Solenoid Valve - Mounted\",1,IF(A42=\"Mechanical Thermostat - Mounted\",1,IF(A42=\"Electronic Room Thermostat - Mounted\",1,0)))))","v":0},{"$f":"IF(I42=\"Thermostatic Expansion Valve - Mounted\",1,IF(I42=\"Electronic Expansion Valve - Mounted\",1,IF(I42=\"Liquid Line Solenoid Valve - Mounted\",1,IF(I42=\"Mechanical Thermostat - Mounted\",1,IF(I42=\"Electronic Room Thermostat - Mounted\",1,0)))))","v":0}]
[null,null,null,null,null,null,null,null,null,null,null,null,null,null,null,null,{"$f":"IF(A43=\"EcoNet\",1,0)","v":0},{"$f":"IF(C43=\"EcoNet\",1,0)","v":0},null,{"$f":"IF(A43=\"Thermostatic Expansion Valve - Mounted\",1,IF(A43=\"Electronic Expansion Valve - Mounted\",1,IF(A43=\"Liquid Line Solenoid Valve - Mounted\",1,IF(A43=\"Mechanical Thermostat - Mounted\",1,IF(A43=\"Electronic Room Thermostat - Mounted\",1,0)))))","v":0},{"$f":"IF(I43=\"Thermostatic Expansion Valve - Mounted\",1,IF(I43=\"Electronic Expansion Valve - Mounted\",1,IF(I43=\"Liquid Line Solenoid Valve - Mounted\",1,IF(I43=\"Mechanical Thermostat - Mounted\",1,IF(I43=\"Electronic Room Thermostat - Mounted\",1,0)))))","v":0}]
[null,null,null,null,null,null,null,null,null,null,null,null,null,null,null,null,"TELLS CAP TABLE WHICH COLUMN TO LOOK ON",null,null,"TELLS CAP TABLE WHICH COLUMN TO LOOK ON",null,null,null,null,{"$f":"IF(AND(OR(F14=X19,F14=X20,F14=X21,F14=\"Air\"),OR(J14=AB16,J14=AB17,J14=AB18,J14=AB19)),AB15)","v":false}]
[null,null,null,null,null,null,null,null,null,null,null,null,null,null,null,null,{"$f":"4&IF(F14=\"Hot Gas - 3 Pipe - Elec. Drain Pan\",\"Hot Gas - 3 Pipe - Elec. Drain Pan\",IF(F14=\"Hot Gas - 3 Pipe - H.G. Drain Pain\",\"Hot Gas - 3 Pipe - H.G. Drain Pain\",\"\"))&\"404A\"","v":"4404A"},5,null,{"$f":"4&IF(F14=\"Hot Gas - 3 Pipe - Elec. Drain Pan\",\"Hot Gas - 3 Pipe - Elec. Drain Pan\",IF(F14=\"Hot Gas - 3 Pipe - H.G. Drain Pain\",\"Hot Gas - 3 Pipe - H.G. Drain Pain\",\"\"))&\"404A\"","v":"4404A"},5,null,{"$f":"IF(OR($S$38=\"E\",$S$38=\"H\",$S$38=\"K\",$S$38=\"G\",$S$38=\"L\",$S$38=\"T\"),\"\",X73)","v":{"$error":"#N/A"}},35,1.04]
[null,null,null,null,null,null,null,null,null,null,null,null,null,null,null,null,{"$f":"6&IF(F14=\"Hot Gas - 3 Pipe - Elec. Drain Pan\",\"Hot Gas - 3 Pipe - Elec. Drain Pan\",IF(F14=\"Hot Gas - 3 Pipe - H.G. Drain Pain\",\"Hot Gas - 3 Pipe - H.G. Drain Pain\",\"\"))&\"404A\"","v":"6404A"},6,null,{"$f":"6&IF(F14=\"Hot Gas - 3 Pipe - Elec. Drain Pan\",\"Hot Gas - 3 Pipe - Elec. Drain Pan\",IF(F14=\"Hot Gas - 3 Pipe - H.G. Drain Pain\",\"Hot Gas - 3 Pipe - H.G. Drain Pain\",\"\"))&\"404A\"","v":"6404A"},6,null,{"$f":"IF(OR($S$38=\"E\",$S$38=\"H\",$S$38=\"K\",$S$38=\"G\",$S$38=\"L\",$S$38=\"T\"),\"\",X74)","v":{"$error":"#N/A"}},25,1]
[null,null,null,null,null,null,null,null,null,null,null,null,null,null,null,null,{"$f":"\"4Electric- Low Temperature\"&\"404A\"","v":"4Electric- Low Temperature404A"},2,null,{"$f":"\"4Electric- Low Temperature\"&\"404A\"","v":"4Electric- Low Temperature404A"},2,null,{"$f":"IF(OR($S$38=\"E\",$S$38=\"H\",$S$38=\"K\",$S$38=\"G\",$S$38=\"L\",$S$38=\"T\",$S$38=\"A\"),\"\",X75)","v":{"$error":"#N/A"}},20,0.98]
[null,null,null,null,null,null,null,null,null,null,null,null,null,null,null,null,{"$f":"\"6Electric- Low Temperature\"&\"404A\"","v":"6Electric- Low Temperature404A"},3,null,{"$f":"\"6Electric- Low Temperature\"&\"404A\"","v":"6Electric- Low Temperature404A"},3,null,{"$f":"IF(OR($S$38=\"E\",$S$38=\"H\",$S$38=\"K\",$S$38=\"G\",$S$38=\"L\",$S$38=\"T\",$S$38=\"A\"),\"\",X76)","v":{"$error":"#N/A"}},15,0.96]
[null,null,null,null,null,null,null,null,null,null,null,null,null,null,null,null,{"$f":"\"6Electric- Medium Temperature\"&\"404A\"","v":"6Electric- Medium Temperature404A"},16,null,{"$f":"\"6Electric- Medium Temperature\"&\"404A\"","v":"6Electric- Medium Temperature404A"},16,null,{"$f":"IF(OR($S$38=\"E\",$S$38=\"H\",$S$38=\"K\",$S$38=\"G\",$S$38=\"L\",$S$38=\"T\",$S$38=\"A\"),\"\",X77)","v":{"$error":"#N/A"}},10,0.94]
[null,null,null,null,null,null,null,null,null,null,null,null,null,null,null,null,{"$f":"\"6Air\"&\"404A\"","v":"6Air404A"},4,null,{"$f":"\"6Air\"&L14&\"404A\"","v":"6Air404A"},4,null,{"$f":"IF(OR($S$38=\"A\",$S$38=\"D\",$S$38=\"S\",$S$38=\"B\",$S$38=\"C\",$S$38=\"M\",$S$38=\"N\"),\"\",X78)","v":{"$error":"#N/A"}},0,1.075]
[null,null,null,null,null,null,null,null,null,null,null,null,null,null,null,null,{"$f":"4&IF(F14=\"Hot Gas - Reverse Cycle - Elec. Drain Pan\",\"Hot Gas - Reverse Cycle - Elec. Drain Pan\",IF(F14=\"Hot Gas - Reverse Cycle - H.G. Drain Pain\",\"Hot Gas - Reverse Cycle - H.G. Drain Pain\",IF(F14=\"Thermobank\",\"Thermobank\",\"\")))&\"404A\"","v":"4404A"},7,null,{"$f":"4&IF(F14=\"Hot Gas - Reverse Cycle - Elec. Drain Pan\",\"Hot Gas - Reverse Cycle - Elec. Drain Pan\",IF(F14=\"Hot Gas - Reverse Cycle - H.G. Drain Pain\",\"Hot Gas - Reverse Cycle - H.G. Drain Pain\",IF(F14=\"Thermobank\",\"Thermobank\",\"\")))&\"404A\"","v":"4404A"},7,null,{"$f":"IF(OR($S$38=\"A\",$S$38=\"D\",$S$38=\"S\",$S$38=\"B\",$S$38=\"C\",$S$38=\"M\",$S$38=\"N\"),\"\",X79)","v":{"$error":"#N/A"}},-10,1.0375000000000001]
[null,null,null,null,null,null,null,null,null,null,null,null,null,null,null,null,{"$f":"6&IF(F14=\"Hot Gas - Reverse Cycle - Elec. Drain Pan\",\"Hot Gas - Reverse Cycle - Elec. Drain Pan\",IF(F14=\"Hot Gas - Reverse Cycle - H.G. Drain Pain\",\"Hot Gas - Reverse Cycle - H.G. Drain Pain\",IF(F14=\"Thermobank\",\"Thermobank\",\"\")))&\"404A\"","v":"6404A"},8,null,{"$f":"6&IF(F14=\"Hot Gas - Reverse Cycle - Elec. Drain Pan\",\"Hot Gas - Reverse Cycle - Elec. Drain Pan\",IF(F14=\"Hot Gas - Reverse Cycle - H.G. Drain Pain\",\"Hot Gas - Reverse Cycle - H.G. Drain Pain\",IF(F14=\"Thermobank\",\"Thermobank\",\"\")))&\"404A\"","v":"6404A"},8,null,{"$f":"IF(OR($S$38=\"A\",$S$38=\"D\",$S$38=\"S\",$S$38=\"B\",$S$38=\"C\",$S$38=\"M\",$S$38=\"N\"),\"\",X80)","v":{"$error":"#N/A"}},-20,1]
[null,null,null,null,null,null,null,null,null,null,null,null,null,null,null,"774(744) IS NOT USED",{"$f":"4&IF(F14=\"Hot Gas - 3 Pipe - Elec. Drain Pan\",\"Hot Gas - 3 Pipe - Elec. Drain Pan\",IF(F14=\"Hot Gas - 3 Pipe - H.G. Drain Pain\",\"Hot Gas - 3 Pipe - H.G. Drain Pain\",\"\"))&\"774\"","v":"4774"},5,null,null,{"$f":"VLOOKUP(E14&F14&\"404A\",T73:U80,2,FALSE)","v":{"$error":"#N/A"}},null,{"$f":"IF(OR($S$38=\"A\",$S$38=\"D\",$S$38=\"S\",$S$38=\"B\",$S$38=\"C\",$S$38=\"M\",$S$38=\"N\"),\"\",X81)","v":{"$error":"#N/A"}},-30,0.96250000000000002]
[null,null,null,null,null,null,null,null,null,null,null,null,null,null,null,null,{"$f":"6&IF(F14=\"Hot Gas - 3 Pipe - Elec. Drain Pan\",\"Hot Gas - 3 Pipe - Elec. Drain Pan\",IF(F14=\"Hot Gas - 3 Pipe - H.G. Drain Pain\",\"Hot Gas - 3 Pipe - H.G. Drain Pain\",\"\"))&\"774\"","v":"6774"},6,null,null,null,null,{"$f":"IF(OR($S$38=\"A\",$S$38=\"D\",$S$38=\"S\",$S$38=\"B\",$S$38=\"C\",$S$38=\"M\",$S$38=\"N\"),\"\",X82)","v":{"$error":"#N/A"}},-40,0.92500000000000004]
[null,null,null,null,null,null,null,null,null,null,null,null,null,null,null,null,{"$f":"\"4Electric- Low Temperature\"&\"774\"","v":"4Electric- Low Temperature774"},2]
[null,null,null,null,null,null,null,null,null,null,null,null,null,null,null,null,{"$f":"\"6Electric- Low Temperature\"&\"774\"","v":"6Electric- Low Temperature774"},3,null,"Thermobank",{"$f":"IF($F$14=T84,1,0)","v":0}]
[null,null,null,null,null,null,null,null,null,null,null,null,null,null,null,null,{"$f":"\"6Electric- Medium Temperature\"&\"774\"","v":"6Electric- Medium Temperature774"},16,null,"Electric- Low Temperature",{"$f":"IF($F$14=T85,1,0)","v":0}]
[null,null,null,null,null,null,null,null,null,null,null,null,null,null,null,null,{"$f":"\"6Air\"&\"774\"","v":"6Air774"},4,null,"Electric- Medium Temperature",{"$f":"IF($F$14=T86,1,0)","v":0}]
[null,null,null,null,null,null,null,null,null,null,null,null,null,null,null,null,{"$f":"4&IF(F14=\"Hot Gas - Reverse Cycle - Elec. Drain Pan\",\"Hot Gas - Reverse Cycle - Elec. Drain Pan\",IF(F14=\"Hot Gas - Reverse Cycle - H.G. Drain Pain\",\"Hot Gas - Reverse Cycle - H.G. Drain Pain\",IF(F14=\"Thermobank\",\"Thermobank\",\"\")))&\"774\"","v":"4774"},7,null,"Hot Gas - 3 Pipe - Elec. Drain Pan",{"$f":"IF($F$14=T87,1,0)","v":0}]
[null,null,null,null,null,null,null,null,null,null,null,null,null,null,null,null,{"$f":"6&IF(F14=\"Hot Gas - Reverse Cycle - Elec. Drain Pan\",\"Hot Gas - Reverse Cycle - Elec. Drain Pan\",IF(F14=\"Hot Gas - Reverse Cycle - H.G. Drain Pain\",\"Hot Gas - Reverse Cycle - H.G. Drain Pain\",IF(F14=\"Thermobank\",\"Thermobank\",\"\")))&\"774\"","v":"6774"},8,null,"Hot Gas - 3 Pipe - H.G. Drain Pain",{"$f":"IF($F$14=T88,1,0)","v":0}]
[null,null,null,null,null,null,null,null,null,null,null,null,null,null,null,null,{"$f":"4&IF(F14=\"Hot Gas - 3 Pipe - Elec. Drain Pan\",\"Hot Gas - 3 Pipe - Elec. Drain Pan\",IF(F14=\"Hot Gas - 3 Pipe - H.G. Drain Pain\",\"Hot Gas - 3 Pipe - H.G. Drain Pain\",\"\"))&J14","v":"4"},12,null,"Hot Gas - Reverse Cycle - Elec. Drain Pan",{"$f":"IF($F$14=T89,1,0)","v":0}]
[null,null,null,null,null,null,null,null,null,null,null,null,null,null,null,null,{"$f":"6&IF(F14=\"Hot Gas - 3 Pipe - Elec. Drain Pan\",\"Hot Gas - 3 Pipe - Elec. Drain Pan\",IF(F14=\"Hot Gas - 3 Pipe - H.G. Drain Pain\",\"Hot Gas - 3 Pipe - H.G. Drain Pain\",\"\"))&J14","v":"6"},13,null,"Hot Gas - Reverse Cycle - H.G. Drain Pain",0]
[null,null,null,null,null,null,null,null,null,null,null,null,null,null,null,null,{"$f":"\"4Electric- Low Temperature\"&J14","v":"4Electric- Low Temperature"},9,null,null,{"$f":"SUM(U84:U90)","v":0}]
[null,null,null,null,null,null,null,null,null,null,null,null,null,null,null,null,{"$f":"\"6Electric- Low Temperature\"&J14","v":"6Electric- Low Temperature"},10]
[null,null,null,null,null,null,null,null,null,null,null,null,null,null,null,null,{"$f":"\"6Electric- Medium Temperature\"&J14","v":"6Electric- Medium Temperature"},17]
[null,null,null,null,null,null,null,null,null,null,null,null,null,null,null,null,{"$f":"\"6Air\"&J14","v":"6Air"},11,null,"FOR HIGH STATIC OPTOIN"]
[null,null,null,null,null,null,null,null,null,null,null,null,null,null,null,null,{"$f":"4&IF(F14=\"Hot Gas - Reverse Cycle - Elec. Drain Pan\",\"Hot Gas - Reverse Cycle - Elec. Drain Pan\",IF(F14=\"Hot Gas - Reverse Cycle - H.G. Drain Pain\",\"Hot Gas - Reverse Cycle - H.G. Drain Pain\",IF(F14=\"Thermobank\",\"Thermobank\",\"\")))&J14","v":"4"},14,null,{"$f":"SUM(T96:U98)","v":0}]
[null,null,null,null,null,null,null,null,null,null,null,null,null,null,null,null,{"$f":"6&IF(F14=\"Hot Gas - Reverse Cycle - Elec. Drain Pan\",\"Hot Gas - Reverse Cycle - Elec. Drain Pan\",IF(F14=\"Hot Gas - Reverse Cycle - H.G. Drain Pain\",\"Hot Gas - Reverse Cycle - H.G. Drain Pain\",IF(F14=\"Thermobank\",\"Thermobank\",\"\")))&J14","v":"6"},15,null,{"$f":"IF(A41=\"High-Static Fan Blades\",1,0)","v":0},{"$f":"IF(I41=\"High-Static Fan Blades\",1,0)","v":0}]
[null,null,null,null,null,null,null,null,null,null,null,null,null,null,null,null,{"$f":"E14&F14&J14","v":""},{"$f":"VLOOKUP(E14&F14&J14,Q73:R96,2,FALSE)","v":{"$error":"#N/A"}},null,{"$f":"IF(A42=\"High-Static Fan Blades\",1,0)","v":0},{"$f":"IF(I42=\"High-Static Fan Blades\",1,0)","v":0}]
[null,null,null,null,null,null,null,null,null,null,null,null,null,null,null,null,null,null,null,{"$f":"IF(A43=\"High-Static Fan Blades\",1,0)","v":0},{"$f":"IF(I43=\"High-Static Fan Blades\",1,0)","v":0}]

{"sheet":"Sheet1","index":1,"n_rows":0,"n_cols":0,"rows_kept":0,"cut":false,"hidden":true,"merged":[]}

{"sheet":"REVISION","index":2,"n_rows":7,"n_cols":3,"rows_kept":7,"cut":false,"hidden":true,"merged":[]}
[]
[1,"2020-07-29","INITIAL RELEASE"]
[1.01,"2020-08-25","corrected macro error, added additional notes field"]
[1.02,"2021-04-01","corrected an error with the look up table submittal - T48:U55"]
[1.03,"2023-08-25","Sloped Drain Pan"]
[1.04,"2023-11-28","Medium Temp Electric Defrost"]
[1.05,"2024-01-30","Adjust medium temp electric defrost models (-1)"]

{"sheet":"SUBMITTAL DATA","index":3,"n_rows":233,"n_cols":30,"rows_kept":233,"cut":false,"hidden":true,"merged":[]}
["LOOKUP","MODEL FAMILY","DEFROST TYPE","NUMBER OF FANS","MOTOR TYPE","UNIT VOLTAGE","FPI","SST","R404A CAPACITY","R407A/R448A/R449A CAPACITY",null,"CFM","MOTOR VOLTAGE","TOTAL UNIT FAN MOTOR AMPS","HEATER VOLTAGE","Number of Heater Circuits","HEATER AMPS EACH CIRCUIT","Total Heater Amps","HEATER WATTS","LIQUID LINE SIZE","SUCTION LINE SIZE","3-PIPE HG LINE","MCA - NO-ECONET","MOPD - NO-ECONET","MCA - ECONET","MOPD - ECONET","NET WEIGHT","APPROX. SHIP WEIGHT","AWEF CLR","AWEF FRZR"]
["H6D030EDA","HEAVY DUTY","ELECTRIC DEFROST - MT",1,"DUAL SPEED EC MOTOR","208-230/3/60",6,null,null,null,null,5920,"208-230/1/60",6.3,"208-230/3/60",1,{"$f":"R2/P2","v":14.4},14.4,6000,"1/2","1-1/8","-",15,20,16.399999999999999,20,"-",470,9,"N/A"]
["H6D042EDA","HEAVY DUTY","ELECTRIC DEFROST - MT",1,"DUAL SPEED EC MOTOR","208-230/3/60",6,null,null,null,null,5870,"208-230/1/60",6.3,"208-230/3/60",1,14.4,14.4,6000,"1/2","1-3/8","-",15,20,16.399999999999999,20,"-",470,9,"N/A"]
["H6D051EDA","HEAVY DUTY","ELECTRIC DEFROST - MT",1,"DUAL SPEED EC MOTOR","208-230/3/60",6,null,null,null,null,5750,"208-230/1/60",6.3,"208-230/3/60",1,14.4,14.4,6000,"5/8","1-5/8","-",15,20,16.399999999999999,20,"-",470,9,"N/A"]
["H6D062EDA","HEAVY DUTY","ELECTRIC DEFROST - MT",2,"DUAL SPEED EC MOTOR","208-230/3/60",6,null,null,null,null,11850,"208-230/1/60",12.6,"208-230/3/60",1,28.9,28.9,12000,"5/8","1-5/8","-",15,20,30.9,35,"-",730,9,"N/A"]
["H6D086EDA","HEAVY DUTY","ELECTRIC DEFROST - MT",2,"DUAL SPEED EC MOTOR","208-230/3/60",6,null,null,null,null,11730,"208-230/1/60",12.6,"208-230/3/60",1,28.9,28.9,12000,"7/8","2-1/8","-",15,20,30.9,35,"-",730,9,"N/A"]
["H6D104EDA","HEAVY DUTY","ELECTRIC DEFROST - MT",2,"DUAL SPEED EC MOTOR","208-230/3/60",6,null,null,null,null,11500,"208-230/1/60",12.6,"208-230/3/60",1,28.9,28.9,12000,"7/8","2-1/8","-",15,20,30.9,35,"-",730,9,"N/A"]
["H6D130EDA","HEAVY DUTY","ELECTRIC DEFROST - MT",3,"DUAL SPEED EC MOTOR","208-230/3/60",6,null,null,null,null,17600,"208-230/1/60",18.899999999999999,"208-230/3/60",1,43.3,43.3,18000,"7/8","2-1/8","-",20.5,25,45.3,50,"-",1000,9,"N/A"]
["H6D155EDA","HEAVY DUTY","ELECTRIC DEFROST - MT",3,"DUAL SPEED EC MOTOR","208-230/3/60",6,null,null,null,null,17250,"208-230/1/60",18.899999999999999,"208-230/3/60",1,43.3,43.3,18000,"1-1/8","2-1/8","-",20.5,25,45.3,50,"-",1000,9,"N/A"]
["H6D174EDA","HEAVY DUTY","ELECTRIC DEFROST - MT",4,"DUAL SPEED EC MOTOR","208-230/3/60",6,null,null,null,null,23000,"208-230/1/60",25.2,"208-230/3/60",2,28.85,57.7,24000,"1-1/8","2-1/8","-",26.8,30,59.7,60,"-",1130,9,"N/A"]
["H6D208EDA","HEAVY DUTY","ELECTRIC DEFROST - MT",4,"DUAL SPEED EC MOTOR","208-230/3/60",6,null,null,null,null,23000,"208-230/1/60",25.2,"208-230/3/60",2,28.85,57.7,24000,"1-1/8","2-1/8","-",26.8,30,59.7,60,"-",1130,9,"N/A"]
["H6D030GDA","HEAVY DUTY","ELECTRIC DEFROST - MT",1,"DUAL SPEED EC MOTOR","460/3/60",6,null,null,null,null,5920,"460/1/60",3.1,"460/3/60",1,7.5,7.5,6000,"1/2","1-1/8","-",15,20,15,20,"-",470,9,"N/A"]
["H6D042GDA","HEAVY DUTY","ELECTRIC DEFROST - MT",1,"DUAL SPEED EC MOTOR","460/3/60",6,null,null,null,null,5870,"460/1/60",3.1,"460/3/60",1,7.5,7.5,6000,"1/2","1-3/8","-",15,20,15,20,"-",470,9,"N/A"]
["H6D051GDA","HEAVY DUTY","ELECTRIC DEFROST - MT",1,"DUAL SPEED EC MOTOR","460/3/60",6,null,null,null,null,5750,"460/1/60",3.1,"460/3/60",1,7.5,7.5,6000,"5/8","1-5/8","-",15,20,15,20,"-",470,9,"N/A"]
["H6D062GDA","HEAVY DUTY","ELECTRIC DEFROST - MT",2,"DUAL SPEED EC MOTOR","460/3/60",6,null,null,null,null,11850,"460/1/60",6.2,"460/3/60",1,15.1,15.1,12000,"5/8","1-5/8","-",15,20,16.100000000000001,20,"-",730,9,"N/A"]
["H6D086GDA","HEAVY DUTY","ELECTRIC DEFROST - MT",2,"DUAL SPEED EC MOTOR","460/3/60",6,null,null,null,null,11730,"460/1/60",6.2,"460/3/60",1,15.1,15.1,12000,"7/8","2-1/8","-",15,20,16.100000000000001,20,"-",730,9,"N/A"]
["H6D104GDA","HEAVY DUTY","ELECTRIC DEFROST - MT",2,"DUAL SPEED EC MOTOR","460/3/60",6,null,null,null,null,11500,"460/1/60",6.2,"460/3/60",1,15.1,15.1,12000,"7/8","2-1/8","-",15,20,16.100000000000001,20,"-",730,9,"N/A"]
["H6D130GDA","HEAVY DUTY","ELECTRIC DEFROST - MT",3,"DUAL SPEED EC MOTOR","460/3/60",6,null,null,null,null,17600,"460/1/60",9.3000000000000007,"460/3/60",1,22.6,22.6,18000,"7/8","2-1/8","-",15,20,23.6,25,"-",1000,9,"N/A"]
["H6D155GDA","HEAVY DUTY","ELECTRIC DEFROST - MT",3,"DUAL SPEED EC MOTOR","460/3/60",6,null,null,null,null,17250,"460/1/60",9.3000000000000007,"460/3/60",1,22.6,22.6,18000,"1-1/8","2-1/8","-",15,20,23.6,25,"-",1000,9,"N/A"]
["H6D174GDA","HEAVY DUTY","ELECTRIC DEFROST - MT",4,"DUAL SPEED EC MOTOR","460/3/60",6,null,null,null,null,23000,"460/1/60",12.4,"460/3/60",1,30.1,30.1,24000,"1-1/8","2-1/8","-",15,20,31.1,35,"-",1130,9,"N/A"]
["H6D208GDA","HEAVY DUTY","ELECTRIC DEFROST - MT",4,"DUAL SPEED EC MOTOR","460/3/60",6,null,null,null,null,23000,"460/1/60",12.4,"460/3/60",1,30.1,30.1,24000,"1-1/8","2-1/8","-",15,20,31.1,35,"-",1130,9,"N/A"]
["H6A031DDA","HEAVY DUTY","AIR DEFROST",1,"DUAL SPEED EC MOTOR","208-230/1/60",6,null,null,null,null,5920,"208-230/1/60",6.3,"-","-",null,"-","-","1/2",1.125,null,15,20,15,20,"-",470,9,"-"]
["H6A043DDA","HEAVY DUTY","AIR DEFROST",1,"DUAL SPEED EC MOTOR","208-230/1/60",6,null,null,null,null,5870,"208-230/1/60",6.3,"-","-",null,"-","-","1/2",1.375,null,15,20,15,20,"-",470,9,"-"]
["H6A052DDA","HEAVY DUTY","AIR DEFROST",1,"DUAL SPEED EC MOTOR","208-230/1/60",6,null,null,null,null,5750,"208-230/1/60",6.3,"-","-",null,"-","-",0.625,1.625,null,15,20,15,20,"-",470,9,"-"]
["H6A063DDA","HEAVY DUTY","AIR DEFROST",2,"DUAL SPEED EC MOTOR","208-230/1/60",6,null,null,null,null,11850,"208-230/1/60",12.6,"-","-",null,"-","-",0.625,1.625,null,15,20,16.2,20,"-",730,9,"-"]
["H6A087DDA","HEAVY DUTY","AIR DEFROST",2,"DUAL SPEED EC MOTOR","208-230/1/60",6,null,null,null,null,11730,"208-230/1/60",12.6,"-","-",null,"-","-",0.875,2.125,null,15,20,16.2,20,"-",730,9,"-"]
["H6A105DDA","HEAVY DUTY","AIR DEFROST",2,"DUAL SPEED EC MOTOR","208-230/1/60",6,null,null,null,null,11500,"208-230/1/60",12.6,"-","-",null,"-","-",0.875,2.125,null,15,20,16.2,20,"-",730,9,"-"]
["H6A132DDA","HEAVY DUTY","AIR DEFROST",3,"DUAL SPEED EC MOTOR","208-230/1/60",6,null,null,null,null,17600,"208-230/1/60",18.899999999999999,"-","-",null,"-","-",0.875,2.125,null,20.5,25,22.5,25,"-",1000,9,"-"]
["H6A156DDA","HEAVY DUTY","AIR DEFROST",3,"DUAL SPEED EC MOTOR","208-230/1/60",6,null,null,null,null,17250,"208-230/1/60",18.899999999999999,"-","-",null,"-","-",1.125,2.125,null,20.5,25,22.5,25,"-",1000,9,"-"]
["H6A175DDA","HEAVY DUTY","AIR DEFROST",4,"DUAL SPEED EC MOTOR","208-230/1/60",6,null,null,null,null,23460,"208-230/1/60",25.2,"-","-",null,"-","-",1.125,2.125,null,26.8,30,28.8,30,"-",1130,9,"-"]
["H6A209DDA","HEAVY DUTY","AIR DEFROST",4,"DUAL SPEED EC MOTOR","208-230/1/60",6,null,null,null,null,23000,"208-230/1/60",25.2,"-","-",null,"-","-",1.125,2.125,null,26.8,30,28.8,30,"-",1130,9,"-"]
["H6A031FDA","HEAVY DUTY","AIR DEFROST",1,"DUAL SPEED EC MOTOR","460/1/60",6,null,null,null,null,5920,"460/1/60",3.1,"-","-",null,"-","-","1/2",1.125,null,15,20,15,20,"-",470,9,"-"]
["H6A043FDA","HEAVY DUTY","AIR DEFROST",1,"DUAL SPEED EC MOTOR","460/1/60",6,null,null,null,null,5870,"460/1/60",3.1,"-","-",null,"-","-","1/2",1.375,null,15,20,15,20,"-",470,9,"-"]
["H6A052FDA","HEAVY DUTY","AIR DEFROST",1,"DUAL SPEED EC MOTOR","460/1/60",6,null,null,null,null,5750,"460/1/60",3.1,"-","-",null,"-","-",0.625,1.625,null,15,20,15,20,"-",470,9,"-"]
["H6A063FDA","HEAVY DUTY","AIR DEFROST",2,"DUAL SPEED EC MOTOR","460/1/60",6,null,null,null,null,11850,"460/1/60",6.2,"-","-",null,"-","-",0.625,1.625,null,15,20,15,20,"-",730,9,"-"]
["H6A087FDA","HEAVY DUTY","AIR DEFROST",2,"DUAL SPEED EC MOTOR","460/1/60",6,null,null,null,null,11730,"460/1/60",6.2,"-","-",null,"-","-",0.875,2.125,null,15,20,15,20,"-",730,9,"-"]
["H6A105FDA","HEAVY DUTY","AIR DEFROST",2,"DUAL SPEED EC MOTOR","460/1/60",6,null,null,null,null,11500,"460/1/60",6.2,"-","-",null,"-","-",0.875,2.125,null,15,20,15,20,"-",730,9,"-"]
["H6A132FDA","HEAVY DUTY","AIR DEFROST",3,"DUAL SPEED EC MOTOR","460/1/60",6,null,null,null,null,17600,"460/1/60",9.3000000000000007,"-","-",null,"-","-",0.875,2.125,null,15,20,15,20,"-",1000,9,"-"]
["H6A156FDA","HEAVY DUTY","AIR DEFROST",3,"DUAL SPEED EC MOTOR","460/1/60",6,null,null,null,null,17250,"460/1/60",9.3000000000000007,"-","-",null,"-","-",1.125,2.125,null,15,20,15,20,"-",1000,9,"-"]
["H6A175FDA","HEAVY DUTY","AIR DEFROST",4,"DUAL SPEED EC MOTOR","460/1/60",6,null,null,null,null,23460,"460/1/60",12.4,"-","-",null,"-","-",1.125,2.125,null,15,20,15,20,"-",1130,9,"-"]
["H6A209FDA","HEAVY DUTY","AIR DEFROST",4,"DUAL SPEED EC MOTOR","460/1/60",6,null,null,null,null,23000,"460/1/60",12.4,"-","-",null,"-","-",1.125,2.125,null,15,20,15,20,"-",1130,9,"-"]
["H6E033EDA","HEAVY DUTY","ELECTRIC DEFROST - LT",1,"DUAL SPEED EC MOTOR","208-230/3/60",6,null,null,null,null,5920,"208-230/1/60",6.3,"208-230/3/60",1,{"$f":"R42/P42","v":14.4},14.4,6000,0.5,2.125,null,15,20,16.399999999999999,20,"-",470,"-",4.1500000000000004]
["H6E044EDA","HEAVY DUTY","ELECTRIC DEFROST - LT",1,"DUAL SPEED EC MOTOR","208-230/3/60",6,null,null,null,null,5870,"208-230/1/60",6.3,"208-230/3/60",1,14.4,14.4,6000,0.625,2.125,null,15,20,16.399999999999999,20,"-",470,"-",4.1500000000000004]
["H6E053EDA","HEAVY DUTY","ELECTRIC DEFROST - LT",1,"DUAL SPEED EC MOTOR","208-230/3/60",6,null,null,null,null,5750,"208-230/1/60",6.3,"208-230/3/60",1,14.4,14.4,6000,0.625,2.125,null,15,20,16.399999999999999,20,"-",470,"-",4.1500000000000004]
["H6E066EDA","HEAVY DUTY","ELECTRIC DEFROST - LT",2,"DUAL SPEED EC MOTOR","208-230/3/60",6,null,null,null,null,11850,"208-230/1/60",12.6,"208-230/3/60",1,28.9,28.9,12000,0.625,2.125,null,15,20,30.9,35,"-",730,"-",4.1500000000000004]
["H6E089EDA","HEAVY DUTY","ELECTRIC DEFROST - LT",2,"DUAL SPEED EC MOTOR","208-230/3/60",6,null,null,null,null,11730,"208-230/1/60",12.6,"208-230/3/60",1,28.9,28.9,12000,0.875,3.125,null,15,20,30.9,35,"-",730,"-",4.1500000000000004]
["H6E109EDA","HEAVY DUTY","ELECTRIC DEFROST - LT",2,"DUAL SPEED EC MOTOR","208-230/3/60",6,null,null,null,null,11500,"208-230/1/60",12.6,"208-230/3/60",1,28.9,28.9,12000,0.875,3.125,null,15,20,30.9,35,"-",730,"-",4.1500000000000004]
["H6E134EDA","HEAVY DUTY","ELECTRIC DEFROST - LT",3,"DUAL SPEED EC MOTOR","208-230/3/60",6,null,null,null,null,17600,"208-230/1/60",18.899999999999999,"208-230/3/60",1,43.3,43.3,18000,1.125,3.125,null,20.5,25,45.3,50,"-",1000,"-",4.1500000000000004]
["H6E163EDA","HEAVY DUTY","ELECTRIC DEFROST - LT",3,"DUAL SPEED EC MOTOR","208-230/3/60",6,null,null,null,null,17250,"208-230/1/60",18.899999999999999,"208-230/3/60",1,43.3,43.3,18000,1.125,3.125,null,20.5,25,45.3,50,"-",1000,"-",4.1500000000000004]
["H6E199EDA","HEAVY DUTY","ELECTRIC DEFROST - LT",4,"DUAL SPEED EC MOTOR","208-230/3/60",6,null,null,null,null,23000,"208-230/1/60",25.2,"208-230/3/60",2,28.85,57.7,24000,1.125,3.125,null,26.8,30,59.7,60,"-",1130,"-",4.1500000000000004]
["H4E035EDA","HEAVY DUTY","ELECTRIC DEFROST - LT",1,"DUAL SPEED EC MOTOR","208-230/3/60",4,null,null,null,null,5870,"208-230/1/60",6.3,"208-230/3/60",1,14.4,14.4,6000,0.5,2.125,null,15,20,16.399999999999999,20,"-",470,"-",4.1500000000000004]
["H4E044EDA","HEAVY DUTY","ELECTRIC DEFROST - LT",1,"DUAL SPEED EC MOTOR","208-230/3/60",4,null,null,null,null,5750,"208-230/1/60",6.3,"208-230/3/60",1,14.4,14.4,6000,0.625,2.125,null,15,20,16.399999999999999,20,"-",470,"-",4.1500000000000004]
["H4E071EDA","HEAVY DUTY","ELECTRIC DEFROST - LT",2,"DUAL SPEED EC MOTOR","208-230/3/60",4,null,null,null,null,11730,"208-230/1/60",12.6,"208-230/3/60",1,28.9,28.9,12000,0.625,2.125,null,15,20,30.9,35,"-",730,"-",4.1500000000000004]
["H4E087EDA","HEAVY DUTY","ELECTRIC DEFROST - LT",2,"DUAL SPEED EC MOTOR","208-230/3/60",4,null,null,null,null,11500,"208-230/1/60",12.6,"208-230/3/60",1,28.9,28.9,12000,0.875,3.125,null,15,20,30.9,35,"-",730,"-",4.1500000000000004]
["H4E107EDA","HEAVY DUTY","ELECTRIC DEFROST - LT",3,"DUAL SPEED EC MOTOR","208-230/3/60",4,null,null,null,null,17600,"208-230/1/60",18.899999999999999,"208-230/3/60",1,43.3,43.3,18000,0.875,3.125,null,20.5,25,45.3,50,"-",1000,"-",4.1500000000000004]
["H4E131EDA","HEAVY DUTY","ELECTRIC DEFROST - LT",3,"DUAL SPEED EC MOTOR","208-230/3/60",4,null,null,null,null,17250,"208-230/1/60",18.899999999999999,"208-230/3/60",1,43.3,43.3,18000,1.125,3.125,null,20.5,25,45.3,50,"-",1000,"-",4.1500000000000004]
["H4E167EDA","HEAVY DUTY","ELECTRIC DEFROST - LT",4,"DUAL SPEED EC MOTOR","208-230/3/60",4,null,null,null,null,23000,"208-230/1/60",25.2,"208-230/3/60",2,28.85,57.7,24000,1.125,3.125,null,26.8,30,59.7,60,"-",1130,"-",4.1500000000000004]
["H6E033GDA","HEAVY DUTY","ELECTRIC DEFROST - LT",1,"DUAL SPEED EC MOTOR","460/3/60",6,null,null,null,null,5920,"460/1/60",3.1,"460/3/60",1,7.5,7.5,6000,0.5,2.125,null,15,20,15,20,"-",470,"-",4.1500000000000004]
["H6E044GDA","HEAVY DUTY","ELECTRIC DEFROST - LT",1,"DUAL SPEED EC MOTOR","460/3/60",6,null,null,null,null,5870,"460/1/60",3.1,"460/3/60",1,7.5,7.5,6000,0.625,2.125,null,15,20,15,20,"-",470,"-",4.1500000000000004]
["H6E053GDA","HEAVY DUTY","ELECTRIC DEFROST - LT",1,"DUAL SPEED EC MOTOR","460/3/60",6,null,null,null,null,5750,"460/1/60",3.1,"460/3/60",1,7.5,7.5,6000,0.625,2.125,null,15,20,15,20,"-",470,"-",4.1500000000000004]
["H6E066GDA","HEAVY DUTY","ELECTRIC DEFROST - LT",2,"DUAL SPEED EC MOTOR","460/3/60",6,null,null,null,null,11850,"460/1/60",6.2,"460/3/60",1,15.1,15.1,12000,0.625,2.125,null,15,20,16.100000000000001,20,"-",730,"-",4.1500000000000004]
["H6E089GDA","HEAVY DUTY","ELECTRIC DEFROST - LT",2,"DUAL SPEED EC MOTOR","460/3/60",6,null,null,null,null,11730,"460/1/60",6.2,"460/3/60",1,15.1,15.1,12000,0.875,3.125,null,15,20,16.100000000000001,20,"-",730,"-",4.1500000000000004]
["H6E109GDA","HEAVY DUTY","ELECTRIC DEFROST - LT",2,"DUAL SPEED EC MOTOR","460/3/60",6,null,null,null,null,11500,"460/1/60",6.2,"460/3/60",1,15.1,15.1,12000,0.875,3.125,null,15,20,16.100000000000001,20,"-",730,"-",4.1500000000000004]
["H6E134GDA","HEAVY DUTY","ELECTRIC DEFROST - LT",3,"DUAL SPEED EC MOTOR","460/3/60",6,null,null,null,null,17600,"460/1/60",9.3000000000000007,"460/3/60",1,22.6,22.6,18000,1.125,3.125,null,15,20,23.6,25,"-",1000,"-",4.1500000000000004]
["H6E163GDA","HEAVY DUTY","ELECTRIC DEFROST - LT",3,"DUAL SPEED EC MOTOR","460/3/60",6,null,null,null,null,17250,"460/1/60",9.3000000000000007,"460/3/60",1,{"$f":"R65/P65","v":22.6},22.6,18000,1.125,3.125,null,15,20,23.6,25,"-",1000,"-",4.1500000000000004]
["H6E199GDA","HEAVY DUTY","ELECTRIC DEFROST - LT",4,"DUAL SPEED EC MOTOR","460/3/60",6,null,null,null,null,23000,"460/1/60",12.4,"460/3/60",1,30.1,30.1,24000,1.125,3.125,null,15,20,31.1,35,"-",1130,"-",4.1500000000000004]
["H4E035GDA","HEAVY DUTY","ELECTRIC DEFROST - LT",1,"DUAL SPEED EC MOTOR","460/3/60",4,null,null,null,null,5870,"460/1/60",3.1,"460/3/60",1,7.5,7.5,6000,0.5,2.125,null,15,20,15,20,"-",470,"-",4.1500000000000004]
["H4E044GDA","HEAVY DUTY","ELECTRIC DEFROST - LT",1,"DUAL SPEED EC MOTOR","460/3/60",4,null,null,null,null,5750,"460/1/60",3.1,"460/3/60",1,7.5,7.5,6000,0.625,2.125,null,15,20,15,20,"-",470,"-",4.1500000000000004]
["H4E071GDA","HEAVY DUTY","ELECTRIC DEFROST - LT",2,"DUAL SPEED EC MOTOR","460/3/60",4,null,null,null,null,11730,"460/1/60",6.2,"460/3/60",1,15.1,15.1,12000,0.625,2.125,null,15,20,16.100000000000001,20,"-",730,"-",4.1500000000000004]
["H4E087GDA","HEAVY DUTY","ELECTRIC DEFROST - LT",2,"DUAL SPEED EC MOTOR","460/3/60",4,null,null,null,null,11500,"460/1/60",6.2,"460/3/60",1,15.1,15.1,12000,0.875,3.125,null,15,20,16.100000000000001,20,"-",730,"-",4.1500000000000004]
["H4E107GDA","HEAVY DUTY","ELECTRIC DEFROST - LT",3,"DUAL SPEED EC MOTOR","460/3/60",4,null,null,null,null,17600,"460/1/60",9.3000000000000007,"460/3/60",1,22.6,22.6,18000,0.875,3.125,null,15,20,23.6,25,"-",1000,"-",4.1500000000000004]
["H4E131GDA","HEAVY DUTY","ELECTRIC DEFROST - LT",3,"DUAL SPEED EC MOTOR","460/3/60",4,null,null,null,null,17250,"460/1/60",9.3000000000000007,"460/3/60",1,22.6,22.6,18000,1.125,3.125,null,15,20,23.6,25,"-",1000,"-",4.1500000000000004]
["H4E167GDA","HEAVY DUTY","ELECTRIC DEFROST - LT",4,"DUAL SPEED EC MOTOR","460/3/60",4,null,null,null,null,23000,"460/1/60",12.4,"460/3/60",1,30.1,30.1,24000,1.125,3.125,null,15,20,31.1,35,"-",1130,"-",4.1500000000000004]
["H6H033DDA","HEAVY DUTY","HOT GAS - 3-PIPE",1,"DUAL SPEED EC MOTOR","208-230/1/60",6,-20,33100,38700,"-",5920,"208-230/1/60",6.3,"208-230/1/60",1,8.3000000000000007,8.3000000000000007,2000,0.5,2.125,"-",15,20,"-","-",293,470,9,4.1500000000000004]
["H6H044DDA","HEAVY DUTY","HOT GAS - 3-PIPE",1,"DUAL SPEED EC MOTOR","208-230/1/60",6,-20,44500,50900,"-",5870,"208-230/1/60",6.3,"208-230/1/60",1,8.3000000000000007,8.3000000000000007,2000,0.625,2.125,"-",15,20,"-","-",293,470,9,4.1500000000000004]
["H6H053DDA","HEAVY DUTY","HOT GAS - 3-PIPE",1,"DUAL SPEED EC MOTOR","208-230/1/60",6,-20,53800,62100,"-",5750,"208-230/1/60",6.3,"208-230/1/60",1,8.3000000000000007,8.3000000000000007,2000,0.625,2.125,"-",15,20,"-","-",293,470,9,4.1500000000000004]
["H6H066DDA","HEAVY DUTY","HOT GAS - 3-PIPE",2,"DUAL SPEED EC MOTOR","208-230/1/60",6,-20,66400,76600,"-",11850,"208-230/1/60",12.6,"208-230/1/60",1,16.7,16.7,4000,0.625,2.125,"-",15,20,"-","-",489,730,9,4.1500000000000004]
["H6H089DDA","HEAVY DUTY","HOT GAS - 3-PIPE",2,"DUAL SPEED EC MOTOR","208-230/1/60",6,-20,89400,102300,"-",11730,"208-230/1/60",12.6,"208-230/1/60",1,16.7,16.7,4000,0.875,3.125,"-",15,20,"-","-",489,730,9,4.1500000000000004]
["H6H109DDA","HEAVY DUTY","HOT GAS - 3-PIPE",2,"DUAL SPEED EC MOTOR","208-230/1/60",6,-20,109200,125700,"-",11500,"208-230/1/60",12.6,"208-230/1/60",1,16.7,16.7,4000,0.875,3.125,"-",15,20,"-","-",489,730,9,4.1500000000000004]
["H6H134DDA","HEAVY DUTY","HOT GAS - 3-PIPE",3,"DUAL SPEED EC MOTOR","208-230/1/60",6,-20,134500,153800,"-",17600,"208-230/1/60",18.899999999999999,"208-230/1/60",1,25,25,6000,1.125,3.125,"-",20.5,25,"-","-",652,1000,9,4.1500000000000004]
["H6H163DDA","HEAVY DUTY","HOT GAS - 3-PIPE",3,"DUAL SPEED EC MOTOR","208-230/1/60",6,-20,163500,188800,"-",17250,"208-230/1/60",18.899999999999999,"208-230/1/60",1,25,25,6000,1.125,3.125,"-",20.5,25,"-","-",652,1000,9,4.1500000000000004]
["H6H199DDA","HEAVY DUTY","HOT GAS - 3-PIPE",4,"DUAL SPEED EC MOTOR","208-230/1/60",6,-20,199100,227400,"-",23000,"208-230/1/60",25.2,"208-230/1/60",1,33.299999999999997,33.299999999999997,8000,1.125,3.125,"-",26.8,30,"-","-",837,1130,9,4.1500000000000004]
["H4H035DDA","HEAVY DUTY","HOT GAS - 3-PIPE",1,"DUAL SPEED EC MOTOR","208-230/1/60",4,-20,35800,41100,"-",5870,"208-230/1/60",6.3,"208-230/1/60",1,8.3000000000000007,8.3000000000000007,2000,0.5,2.125,"-",15,20,"-","-",293,470,"N/A",4.1500000000000004]
["H4H044DDA","HEAVY DUTY","HOT GAS - 3-PIPE",1,"DUAL SPEED EC MOTOR","208-230/1/60",4,-20,44000,50800,"-",5750,"208-230/1/60",6.3,"208-230/1/60",1,8.3000000000000007,8.3000000000000007,2000,0.625,2.125,"-",15,20,"-","-",293,470,"N/A",4.1500000000000004]
["H4H071DDA","HEAVY DUTY","HOT GAS - 3-PIPE",2,"DUAL SPEED EC MOTOR","208-230/1/60",4,-20,71400,83000,"-",11730,"208-230/1/60",12.6,"208-230/1/60",1,16.7,16.7,4000,0.625,2.125,"-",15,20,"-","-",489,730,"N/A",4.1500000000000004]
["H4H087DDA","HEAVY DUTY","HOT GAS - 3-PIPE",2,"DUAL SPEED EC MOTOR","208-230/1/60",4,-20,87400,100900,"-",11500,"208-230/1/60",12.6,"208-230/1/60",1,16.7,16.7,4000,0.875,3.125,"-",15,20,"-","-",489,730,"N/A",4.1500000000000004]
["H4H107DDA","HEAVY DUTY","HOT GAS - 3-PIPE",3,"DUAL SPEED EC MOTOR","208-230/1/60",4,-20,107700,122900,"-",17600,"208-230/1/60",18.899999999999999,"208-230/1/60",1,25,25,6000,0.875,3.125,"-",20.5,25,"-","-",652,1000,"N/A",4.1500000000000004]
["H4H131DDA","HEAVY DUTY","HOT GAS - 3-PIPE",3,"DUAL SPEED EC MOTOR","208-230/1/60",4,-20,131900,152300,"-",17250,"208-230/1/60",18.899999999999999,"208-230/1/60",1,25,25,6000,1.125,3.125,"-",20.5,25,"-","-",652,1000,"N/A",4.1500000000000004]
["H4H167DDA","HEAVY DUTY","HOT GAS - 3-PIPE",4,"DUAL SPEED EC MOTOR","208-230/1/60",4,-20,167000,190200,"-",23000,"208-230/1/60",25.2,"208-230/1/60",1,33.299999999999997,33.299999999999997,8000,1.125,3.125,"-",26.8,30,"-","-",837,1130,"N/A",4.1500000000000004]
["H6H033FDA","HEAVY DUTY","HOT GAS - 3-PIPE",1,"DUAL SPEED EC MOTOR","460/1/60",6,-20,33100,38700,"-",5920,"460/1/60",3.1,"460/1/60",1,4.3,4.3,2000,0.5,2.125,"-",15,20,"-","-",293,470,9,4.1500000000000004]
["H6H044FDA","HEAVY DUTY","HOT GAS - 3-PIPE",1,"DUAL SPEED EC MOTOR","460/1/60",6,-20,44500,50900,"-",5870,"460/1/60",3.1,"460/1/60",1,4.3,4.3,2000,0.625,2.125,"-",15,20,"-","-",293,470,9,4.1500000000000004]
["H6H053FDA","HEAVY DUTY","HOT GAS - 3-PIPE",1,"DUAL SPEED EC MOTOR","460/1/60",6,-20,53800,62100,"-",5750,"460/1/60",3.1,"460/1/60",1,4.3,4.3,2000,0.625,2.125,"-",15,20,"-","-",293,470,9,4.1500000000000004]
["H6H066FDA","HEAVY DUTY","HOT GAS - 3-PIPE",2,"DUAL SPEED EC MOTOR","460/1/60",6,-20,66400,76600,"-",11850,"460/1/60",6.2,"460/1/60",1,8.6999999999999993,8.6999999999999993,4000,0.625,2.125,"-",15,20,"-","-",489,730,9,4.1500000000000004]
["H6H089FDA","HEAVY DUTY","HOT GAS - 3-PIPE",2,"DUAL SPEED EC MOTOR","460/1/60",6,-20,89400,102300,"-",11730,"460/1/60",6.2,"460/1/60",1,8.6999999999999993,8.6999999999999993,4000,0.875,3.125,"-",15,20,"-","-",489,730,9,4.1500000000000004]
["H6H109FDA","HEAVY DUTY","HOT GAS - 3-PIPE",2,"DUAL SPEED EC MOTOR","460/1/60",6,-20,109200,125700,"-",11500,"460/1/60",6.2,"460/1/60",1,8.6999999999999993,8.6999999999999993,4000,0.875,3.125,"-",15,20,"-","-",489,730,9,4.1500000000000004]
["H6H134FDA","HEAVY DUTY","HOT GAS - 3-PIPE",3,"DUAL SPEED EC MOTOR","460/1/60",6,-20,134500,153800,"-",17600,"460/1/60",9.3000000000000007,"460/1/60",1,13,13,6000,1.125,3.125,"-",15,20,"-","-",652,1000,9,4.1500000000000004]
["H6H163FDA","HEAVY DUTY","HOT GAS - 3-PIPE",3,"DUAL SPEED EC MOTOR","460/1/60",6,-20,163500,188800,"-",17250,"460/1/60",9.3000000000000007,"460/1/60",1,13,13,6000,1.125,3.125,"-",15,20,"-","-",652,1000,9,4.1500000000000004]
["H6H199FDA","HEAVY DUTY","HOT GAS - 3-PIPE",4,"DUAL SPEED EC MOTOR","460/1/60",6,-20,199100,227400,"-",23000,"460/1/60",12.4,"460/1/60",1,17.399999999999999,17.399999999999999,8000,1.125,3.125,"-",15,20,"-","-",837,1130,9,4.1500000000000004]
["H4H035FDA","HEAVY DUTY","HOT GAS - 3-PIPE",1,"DUAL SPEED EC MOTOR","460/1/60",4,-20,35800,41100,"-",5870,"460/1/60",3.1,"460/1/60",1,4.3,4.3,2000,0.5,2.125,"-",15,20,"-","-",293,470,"N/A",4.1500000000000004]
["H4H044FDA","HEAVY DUTY","HOT GAS - 3-PIPE",1,"DUAL SPEED EC MOTOR","460/1/60",4,-20,44000,50800,"-",5750,"460/1/60",3.1,"460/1/60",1,4.3,4.3,2000,0.625,2.125,"-",15,20,"-","-",293,470,"N/A",4.1500000000000004]
["H4H071FDA","HEAVY DUTY","HOT GAS - 3-PIPE",2,"DUAL SPEED EC MOTOR","460/1/60",4,-20,71400,83000,"-",11730,"460/1/60",6.2,"460/1/60",1,8.6999999999999993,8.6999999999999993,4000,0.625,2.125,"-",15,20,"-","-",489,730,"N/A",4.1500000000000004]
["H4H087FDA","HEAVY DUTY","HOT GAS - 3-PIPE",2,"DUAL SPEED EC MOTOR","460/1/60",4,-20,87400,100900,"-",11500,"460/1/60",6.2,"460/1/60",1,8.6999999999999993,8.6999999999999993,4000,0.875,3.125,"-",15,20,"-","-",489,730,"N/A",4.1500000000000004]
["H4H107FDA","HEAVY DUTY","HOT GAS - 3-PIPE",3,"DUAL SPEED EC MOTOR","460/1/60",4,-20,107700,122900,"-",17600,"460/1/60",9.3000000000000007,"460/1/60",1,13,13,6000,0.875,3.125,"-",15,20,"-","-",652,1000,"N/A",4.1500000000000004]
["H4H131FDA","HEAVY DUTY","HOT GAS - 3-PIPE",3,"DUAL SPEED EC MOTOR","460/1/60",4,-20,131900,152300,"-",17250,"460/1/60",9.3000000000000007,"460/1/60",1,13,13,6000,1.125,3.125,"-",15,20,"-","-",652,1000,"N/A",4.1500000000000004]
["H4H167FDA","HEAVY DUTY","HOT GAS - 3-PIPE",4,"DUAL SPEED EC MOTOR","460/1/60",4,-20,167000,190200,"-",23000,"460/1/60",12.4,"460/1/60",1,17.399999999999999,17.399999999999999,8000,1.125,3.125,"-",15,20,"-","-",837,1130,"N/A",4.1500000000000004]
["H6K033DDA","HEAVY DUTY","HOT GAS - 3-PIPE",1,"DUAL SPEED EC MOTOR","208-230/1/60",6,-20,33100,38700,"-",5920,"208-230/1/60",6.3,"-","-","-","-","-",0.5,2.125,1.125,15,20,"-","-",293,470,9,4.1500000000000004]
["H6K044DDA","HEAVY DUTY","HOT GAS - 3-PIPE",1,"DUAL SPEED EC MOTOR","208-230/1/60",6,-20,44500,50900,"-",5870,"208-230/1/60",6.3,"-","-","-","-","-",0.625,2.125,1.125,15,20,"-","-",293,470,9,4.1500000000000004]
["H6K053DDA","HEAVY DUTY","HOT GAS - 3-PIPE",1,"DUAL SPEED EC MOTOR","208-230/1/60",6,-20,53800,62100,"-",5750,"208-230/1/60",6.3,"-","-","-","-","-",0.625,2.125,1.125,15,20,"-","-",293,470,9,4.1500000000000004]
["H6K066DDA","HEAVY DUTY","HOT GAS - 3-PIPE",2,"DUAL SPEED EC MOTOR","208-230/1/60",6,-20,66400,76600,"-",11850,"208-230/1/60",12.6,"-","-","-","-","-",0.625,2.125,1.125,15,20,"-","-",489,730,9,4.1500000000000004]
["H6K089DDA","HEAVY DUTY","HOT GAS - 3-PIPE",2,"DUAL SPEED EC MOTOR","208-230/1/60",6,-20,89400,102300,"-",11730,"208-230/1/60",12.6,"-","-","-","-","-",0.875,3.125,1.125,15,20,"-","-",489,730,9,4.1500000000000004]
["H6K109DDA","HEAVY DUTY","HOT GAS - 3-PIPE",2,"DUAL SPEED EC MOTOR","208-230/1/60",6,-20,109200,125700,"-",11500,"208-230/1/60",12.6,"-","-","-","-","-",0.875,3.125,1.125,15,20,"-","-",489,730,9,4.1500000000000004]
["H6K134DDA","HEAVY DUTY","HOT GAS - 3-PIPE",3,"DUAL SPEED EC MOTOR","208-230/1/60",6,-20,134500,153800,"-",17600,"208-230/1/60",18.899999999999999,"-","-","-","-","-",1.125,3.125,1.375,20.5,25,"-","-",652,1000,9,4.1500000000000004]
["H6K163DDA","HEAVY DUTY","HOT GAS - 3-PIPE",3,"DUAL SPEED EC MOTOR","208-230/1/60",6,-20,163500,188800,"-",17250,"208-230/1/60",18.899999999999999,"-","-","-","-","-",1.125,3.125,1.375,20.5,25,"-","-",652,1000,9,4.1500000000000004]
["H6K199DDA","HEAVY DUTY","HOT GAS - 3-PIPE",4,"DUAL SPEED EC MOTOR","208-230/1/60",6,-20,199100,227400,"-",23000,"208-230/1/60",25.2,"-","-","-","-","-",1.125,3.125,1.375,26.8,30,"-","-",837,1130,9,4.1500000000000004]
["H4K035DDA","HEAVY DUTY","HOT GAS - 3-PIPE",1,"DUAL SPEED EC MOTOR","208-230/1/60",4,-20,35800,41100,"-",5870,"208-230/1/60",6.3,"-","-","-","-","-",0.5,2.125,1.125,15,20,"-","-",293,470,"N/A",4.1500000000000004]
["H4K044DDA","HEAVY DUTY","HOT GAS - 3-PIPE",1,"DUAL SPEED EC MOTOR","208-230/1/60",4,-20,44000,50800,"-",5750,"208-230/1/60",6.3,"-","-","-","-","-",0.625,2.125,1.125,15,20,"-","-",293,470,"N/A",4.1500000000000004]
["H4K071DDA","HEAVY DUTY","HOT GAS - 3-PIPE",2,"DUAL SPEED EC MOTOR","208-230/1/60",4,-20,71400,83000,"-",11730,"208-230/1/60",12.6,"-","-","-","-","-",0.625,2.125,1.125,15,20,"-","-",489,730,"N/A",4.1500000000000004]
["H4K087DDA","HEAVY DUTY","HOT GAS - 3-PIPE",2,"DUAL SPEED EC MOTOR","208-230/1/60",4,-20,87400,100900,"-",11500,"208-230/1/60",12.6,"-","-","-","-","-",0.875,3.125,1.125,15,20,"-","-",489,730,"N/A",4.1500000000000004]
["H4K107DDA","HEAVY DUTY","HOT GAS - 3-PIPE",3,"DUAL SPEED EC MOTOR","208-230/1/60",4,-20,107700,122900,"-",17600,"208-230/1/60",18.899999999999999,"-","-","-","-","-",0.875,3.125,1.375,20.5,25,"-","-",652,1000,"N/A",4.1500000000000004]
["H4K131DDA","HEAVY DUTY","HOT GAS - 3-PIPE",3,"DUAL SPEED EC MOTOR","208-230/1/60",4,-20,131900,152300,"-",17250,"208-230/1/60",18.899999999999999,"-","-","-","-","-",1.125,3.125,1.375,20.5,25,"-","-",652,1000,"N/A",4.1500000000000004]
["H4K167DDA","HEAVY DUTY","HOT GAS - 3-PIPE",4,"DUAL SPEED EC MOTOR","208-230/1/60",4,-20,167000,190200,"-",23000,"208-230/1/60",25.2,"-","-","-","-","-",1.125,3.125,1.375,26.8,30,"-","-",837,1130,"N/A",4.1500000000000004]
["H6K033FDA","HEAVY DUTY","HOT GAS - 3-PIPE",1,"DUAL SPEED EC MOTOR","460/1/60",6,-20,33100,38700,"-",5920,"460/1/60",3.1,"-","-","-","-","-",0.5,2.125,1.125,15,20,"-","-",293,470,9,4.1500000000000004]
["H6K044FDA","HEAVY DUTY","HOT GAS - 3-PIPE",1,"DUAL SPEED EC MOTOR","460/1/60",6,-20,44500,50900,"-",5870,"460/1/60",3.1,"-","-","-","-","-",0.625,2.125,1.125,15,20,"-","-",293,470,9,4.1500000000000004]
["H6K053FDA","HEAVY DUTY","HOT GAS - 3-PIPE",1,"DUAL SPEED EC MOTOR","460/1/60",6,-20,53800,62100,"-",5750,"460/1/60",3.1,"-","-","-","-","-",0.625,2.125,1.125,15,20,"-","-",293,470,9,4.1500000000000004]
["H6K066FDA","HEAVY DUTY","HOT GAS - 3-PIPE",2,"DUAL SPEED EC MOTOR","460/1/60",6,-20,66400,76600,"-",11850,"460/1/60",6.2,"-","-","-","-","-",0.625,2.125,1.125,15,20,"-","-",489,730,9,4.1500000000000004]
["H6K089FDA","HEAVY DUTY","HOT GAS - 3-PIPE",2,"DUAL SPEED EC MOTOR","460/1/60",6,-20,89400,102300,"-",11730,"460/1/60",6.2,"-","-","-","-","-",0.875,3.125,1.125,15,20,"-","-",489,730,9,4.1500000000000004]
["H6K109FDA","HEAVY DUTY","HOT GAS - 3-PIPE",2,"DUAL SPEED EC MOTOR","460/1/60",6,-20,109200,125700,"-",11500,"460/1/60",6.2,"-","-","-","-","-",0.875,3.125,1.125,15,20,"-","-",489,730,9,4.1500000000000004]
["H6K134FDA","HEAVY DUTY","HOT GAS - 3-PIPE",3,"DUAL SPEED EC MOTOR","460/1/60",6,-20,134500,153800,"-",17600,"460/1/60",9.3000000000000007,"-","-","-","-","-",1.125,3.125,1.375,15,20,"-","-",652,1000,9,4.1500000000000004]
["H6K163FDA","HEAVY DUTY","HOT GAS - 3-PIPE",3,"DUAL SPEED EC MOTOR","460/1/60",6,-20,163500,188800,"-",17250,"460/1/60",9.3000000000000007,"-","-","-","-","-",1.125,3.125,1.375,15,20,"-","-",652,1000,9,4.1500000000000004]
["H6K199FDA","HEAVY DUTY","HOT GAS - 3-PIPE",4,"DUAL SPEED EC MOTOR","460/1/60",6,-20,199100,227400,"-",23000,"460/1/60",12.4,"-","-","-","-","-",1.125,3.125,1.375,15,20,"-","-",837,1130,9,4.1500000000000004]
["H4K035FDA","HEAVY DUTY","HOT GAS - 3-PIPE",1,"DUAL SPEED EC MOTOR","460/1/60",4,-20,35800,41100,"-",5870,"460/1/60",3.1,"-","-","-","-","-",0.5,2.125,1.125,15,20,"-","-",293,470,"N/A",4.1500000000000004]
["H4K044FDA","HEAVY DUTY","HOT GAS - 3-PIPE",1,"DUAL SPEED EC MOTOR","460/1/60",4,-20,44000,50800,"-",5750,"460/1/60",3.1,"-","-","-","-","-",0.625,2.125,1.125,15,20,"-","-",293,470,"N/A",4.1500000000000004]
["H4K071FDA","HEAVY DUTY","HOT GAS - 3-PIPE",2,"DUAL SPEED EC MOTOR","460/1/60",4,-20,71400,83000,"-",11730,"460/1/60",6.2,"-","-","-","-","-",0.625,2.125,1.125,15,20,"-","-",489,730,"N/A",4.1500000000000004]
["H4K087FDA","HEAVY DUTY","HOT GAS - 3-PIPE",2,"DUAL SPEED EC MOTOR","460/1/60",4,-20,87400,100900,"-",11500,"460/1/60",6.2,"-","-","-","-","-",0.875,3.125,1.125,15,20,"-","-",489,730,"N/A",4.1500000000000004]
["H4K107FDA","HEAVY DUTY","HOT GAS - 3-PIPE",3,"DUAL SPEED EC MOTOR","460/1/60",4,-20,107700,122900,"-",17600,"460/1/60",9.3000000000000007,"-","-","-","-","-",0.875,3.125,1.375,15,20,"-","-",652,1000,"N/A",4.1500000000000004]
["H4K131FDA","HEAVY DUTY","HOT GAS - 3-PIPE",3,"DUAL SPEED EC MOTOR","460/1/60",4,-20,131900,152300,"-",17250,"460/1/60",9.3000000000000007,"-","-","-","-","-",1.125,3.125,1.375,15,20,"-","-",652,1000,"N/A",4.1500000000000004]
["H4K167FDA","HEAVY DUTY","HOT GAS - 3-PIPE",4,"DUAL SPEED EC MOTOR","460/1/60",4,-20,167000,190200,"-",23000,"460/1/60",12.4,"-","-","-","-","-",1.125,3.125,1.375,15,20,"-","-",837,1130,"N/A",4.1500000000000004]
["H6G033DDA","HEAVY DUTY","HOT GAS - REVERSE CYCLE",1,"DUAL SPEED EC MOTOR","208-230/1/60",6,-20,33100,38700,"-",5920,"208-230/1/60",6.3,"208-230/1/60",1,8.3000000000000007,8.3000000000000007,2000,0.5,2.125,"-",15,20,"-","-",293,470,9,4.1500000000000004]
["H6G044DDA","HEAVY DUTY","HOT GAS - REVERSE CYCLE",1,"DUAL SPEED EC MOTOR","208-230/1/60",6,-20,44500,50900,"-",5870,"208-230/1/60",6.3,"208-230/1/60",1,8.3000000000000007,8.3000000000000007,2000,0.625,2.125,"-",15,20,"-","-",293,470,9,4.1500000000000004]
["H6G053DDA","HEAVY DUTY","HOT GAS - REVERSE CYCLE",1,"DUAL SPEED EC MOTOR","208-230/1/60",6,-20,53800,62100,"-",5750,"208-230/1/60",6.3,"208-230/1/60",1,8.3000000000000007,8.3000000000000007,2000,0.625,2.125,"-",15,20,"-","-",293,470,9,4.1500000000000004]
["H6G066DDA","HEAVY DUTY","HOT GAS - REVERSE CYCLE",2,"DUAL SPEED EC MOTOR","208-230/1/60",6,-20,66400,76600,"-",11850,"208-230/1/60",12.6,"208-230/1/60",1,16.7,16.7,4000,0.625,2.125,"-",15,20,"-","-",489,730,9,4.1500000000000004]
["H6G089DDA","HEAVY DUTY","HOT GAS - REVERSE CYCLE",2,"DUAL SPEED EC MOTOR","208-230/1/60",6,-20,89400,102300,"-",11730,"208-230/1/60",12.6,"208-230/1/60",1,16.7,16.7,4000,0.875,3.125,"-",15,20,"-","-",489,730,9,4.1500000000000004]
["H6G109DDA","HEAVY DUTY","HOT GAS - REVERSE CYCLE",2,"DUAL SPEED EC MOTOR","208-230/1/60",6,-20,109200,125700,"-",11500,"208-230/1/60",12.6,"208-230/1/60",1,16.7,16.7,4000,0.875,3.125,"-",15,20,"-","-",489,730,9,4.1500000000000004]
["H6G134DDA","HEAVY DUTY","HOT GAS - REVERSE CYCLE",3,"DUAL SPEED EC MOTOR","208-230/1/60",6,-20,134500,153800,"-",17600,"208-230/1/60",18.899999999999999,"208-230/1/60",1,25,25,6000,1.125,3.125,"-",20.5,25,"-","-",652,1000,9,4.1500000000000004]
["H6G163DDA","HEAVY DUTY","HOT GAS - REVERSE CYCLE",3,"DUAL SPEED EC MOTOR","208-230/1/60",6,-20,163500,188800,"-",17250,"208-230/1/60",18.899999999999999,"208-230/1/60",1,25,25,6000,1.125,3.125,"-",20.5,25,"-","-",652,1000,9,4.1500000000000004]
["H6G199DDA","HEAVY DUTY","HOT GAS - REVERSE CYCLE",4,"DUAL SPEED EC MOTOR","208-230/1/60",6,-20,199100,227400,"-",23000,"208-230/1/60",25.2,"208-230/1/60",1,33.299999999999997,33.299999999999997,8000,1.125,3.125,"-",26.8,30,"-","-",837,1130,9,4.1500000000000004]
["H4G035DDA","HEAVY DUTY","HOT GAS - REVERSE CYCLE",1,"DUAL SPEED EC MOTOR","208-230/1/60",4,-20,35800,41100,"-",5870,"208-230/1/60",6.3,"208-230/1/60",1,8.3000000000000007,8.3000000000000007,2000,0.5,2.125,"-",15,20,"-","-",293,470,"N/A",4.1500000000000004]
["H4G044DDA","HEAVY DUTY","HOT GAS - REVERSE CYCLE",1,"DUAL SPEED EC MOTOR","208-230/1/60",4,-20,44000,50800,"-",5750,"208-230/1/60",6.3,"208-230/1/60",1,8.3000000000000007,8.3000000000000007,2000,0.625,2.125,"-",15,20,"-","-",293,470,"N/A",4.1500000000000004]
["H4G071DDA","HEAVY DUTY","HOT GAS - REVERSE CYCLE",2,"DUAL SPEED EC MOTOR","208-230/1/60",4,-20,71400,83000,"-",11730,"208-230/1/60",12.6,"208-230/1/60",1,16.7,16.7,4000,0.625,2.125,"-",15,20,"-","-",489,730,"N/A",4.1500000000000004]
["H4G087DDA","HEAVY DUTY","HOT GAS - REVERSE CYCLE",2,"DUAL SPEED EC MOTOR","208-230/1/60",4,-20,87400,100900,"-",11500,"208-230/1/60",12.6,"208-230/1/60",1,16.7,16.7,4000,0.875,3.125,"-",15,20,"-","-",489,730,"N/A",4.1500000000000004]
["H4G107DDA","HEAVY DUTY","HOT GAS - REVERSE CYCLE",3,"DUAL SPEED EC MOTOR","208-230/1/60",4,-20,107700,122900,"-",17600,"208-230/1/60",18.899999999999999,"208-230/1/60",1,25,25,6000,0.875,3.125,"-",20.5,25,"-","-",652,1000,"N/A",4.1500000000000004]
["H4G131DDA","HEAVY DUTY","HOT GAS - REVERSE CYCLE",3,"DUAL SPEED EC MOTOR","208-230/1/60",4,-20,131900,152300,"-",17250,"208-230/1/60",18.899999999999999,"208-230/1/60",1,25,25,6000,1.125,3.125,"-",20.5,25,"-","-",652,1000,"N/A",4.1500000000000004]
["H4G167DDA","HEAVY DUTY","HOT GAS - REVERSE CYCLE",4,"DUAL SPEED EC MOTOR","208-230/1/60",4,-20,167000,190200,"-",23000,"208-230/1/60",25.2,"208-230/1/60",1,33.299999999999997,33.299999999999997,8000,1.125,3.125,"-",26.8,30,"-","-",837,1130,"N/A",4.1500000000000004]
["H6G033FDA","HEAVY DUTY","HOT GAS - REVERSE CYCLE",1,"DUAL SPEED EC MOTOR","460/1/60",6,-20,33100,38700,"-",5920,"460/1/60",3.1,"460/1/60",1,4.3,4.3,2000,0.5,2.125,"-",15,20,"-","-",293,470,9,4.1500000000000004]
["H6G044FDA","HEAVY DUTY","HOT GAS - REVERSE CYCLE",1,"DUAL SPEED EC MOTOR","460/1/60",6,-20,44500,50900,"-",5870,"460/1/60",3.1,"460/1/60",1,4.3,4.3,2000,0.625,2.125,"-",15,20,"-","-",293,470,9,4.1500000000000004]
["H6G053FDA","HEAVY DUTY","HOT GAS - REVERSE CYCLE",1,"DUAL SPEED EC MOTOR","460/1/60",6,-20,53800,62100,"-",5750,"460/1/60",3.1,"460/1/60",1,4.3,4.3,2000,0.625,2.125,"-",15,20,"-","-",293,470,9,4.1500000000000004]
["H6G066FDA","HEAVY DUTY","HOT GAS - REVERSE CYCLE",2,"DUAL SPEED EC MOTOR","460/1/60",6,-20,66400,76600,"-",11850,"460/1/60",6.2,"460/1/60",1,8.6999999999999993,8.6999999999999993,4000,0.625,2.125,"-",15,20,"-","-",489,730,9,4.1500000000000004]
["H6G089FDA","HEAVY DUTY","HOT GAS - REVERSE CYCLE",2,"DUAL SPEED EC MOTOR","460/1/60",6,-20,89400,102300,"-",11730,"460/1/60",6.2,"460/1/60",1,8.6999999999999993,8.6999999999999993,4000,0.875,3.125,"-",15,20,"-","-",489,730,9,4.1500000000000004]
["H6G109FDA","HEAVY DUTY","HOT GAS - REVERSE CYCLE",2,"DUAL SPEED EC MOTOR","460/1/60",6,-20,109200,125700,"-",11500,"460/1/60",6.2,"460/1/60",1,8.6999999999999993,8.6999999999999993,4000,0.875,3.125,"-",15,20,"-","-",489,730,9,4.1500000000000004]
["H6G134FDA","HEAVY DUTY","HOT GAS - REVERSE CYCLE",3,"DUAL SPEED EC MOTOR","460/1/60",6,-20,134500,153800,"-",17600,"460/1/60",9.3000000000000007,"460/1/60",1,13,13,6000,1.125,3.125,"-",15,20,"-","-",652,1000,9,4.1500000000000004]
["H6G163FDA","HEAVY DUTY","HOT GAS - REVERSE CYCLE",3,"DUAL SPEED EC MOTOR","460/1/60",6,-20,163500,188800,"-",17250,"460/1/60",9.3000000000000007,"460/1/60",1,13,13,6000,1.125,3.125,"-",15,20,"-","-",652,1000,9,4.1500000000000004]
["H6G199FDA","HEAVY DUTY","HOT GAS - REVERSE CYCLE",4,"DUAL SPEED EC MOTOR","460/1/60",6,-20,199100,227400,"-",23000,"460/1/60",12.4,"460/1/60",1,17.399999999999999,17.399999999999999,8000,1.125,3.125,"-",15,20,"-","-",837,1130,9,4.1500000000000004]
["H4G035FDA","HEAVY DUTY","HOT GAS - REVERSE CYCLE",1,"DUAL SPEED EC MOTOR","460/1/60",4,-20,35800,41100,"-",5870,"460/1/60",3.1,"460/1/60",1,4.3,4.3,2000,0.5,2.125,"-",15,20,"-","-",293,470,"N/A",4.1500000000000004]
["H4G044FDA","HEAVY DUTY","HOT GAS - REVERSE CYCLE",1,"DUAL SPEED EC MOTOR","460/1/60",4,-20,44000,50800,"-",5750,"460/1/60",3.1,"460/1/60",1,4.3,4.3,2000,0.625,2.125,"-",15,20,"-","-",293,470,"N/A",4.1500000000000004]
["H4G071FDA","HEAVY DUTY","HOT GAS - REVERSE CYCLE",2,"DUAL SPEED EC MOTOR","460/1/60",4,-20,71400,83000,"-",11730,"460/1/60",6.2,"460/1/60",1,8.6999999999999993,8.6999999999999993,4000,0.625,2.125,"-",15,20,"-","-",489,730,"N/A",4.1500000000000004]
["H4G087FDA","HEAVY DUTY","HOT GAS - REVERSE CYCLE",2,"DUAL SPEED EC MOTOR","460/1/60",4,-20,87400,100900,"-",11500,"460/1/60",6.2,"460/1/60",1,8.6999999999999993,8.6999999999999993,4000,0.875,3.125,"-",15,20,"-","-",489,730,"N/A",4.1500000000000004]
["H4G107FDA","HEAVY DUTY","HOT GAS - REVERSE CYCLE",3,"DUAL SPEED EC MOTOR","460/1/60",4,-20,107700,122900,"-",17600,"460/1/60",9.3000000000000007,"460/1/60",1,13,13,6000,0.875,3.125,"-",15,20,"-","-",652,1000,"N/A",4.1500000000000004]
["H4G131FDA","HEAVY DUTY","HOT GAS - REVERSE CYCLE",3,"DUAL SPEED EC MOTOR","460/1/60",4,-20,131900,152300,"-",17250,"460/1/60",9.3000000000000007,"460/1/60",1,13,13,6000,1.125,3.125,"-",15,20,"-","-",652,1000,"N/A",4.1500000000000004]
["H4G167FDA","HEAVY DUTY","HOT GAS - REVERSE CYCLE",4,"DUAL SPEED EC MOTOR","460/1/60",4,-20,167000,190200,"-",23000,"460/1/60",12.4,"460/1/60",1,17.399999999999999,17.399999999999999,8000,1.125,3.125,"-",15,20,"-","-",837,1130,"N/A",4.1500000000000004]
["H6L033DDA","HEAVY DUTY","HOT GAS - REVERSE CYCLE",1,"DUAL SPEED EC MOTOR","208-230/1/60",6,-20,33100,38700,"-",5920,"208-230/1/60",6.3,"-","-","-","-","-",0.5,2.125,1.125,15,20,"-","-",293,470,9,4.1500000000000004]
["H6L044DDA","HEAVY DUTY","HOT GAS - REVERSE CYCLE",1,"DUAL SPEED EC MOTOR","208-230/1/60",6,-20,44500,50900,"-",5870,"208-230/1/60",6.3,"-","-","-","-","-",0.625,2.125,1.125,15,20,"-","-",293,470,9,4.1500000000000004]
["H6L053DDA","HEAVY DUTY","HOT GAS - REVERSE CYCLE",1,"DUAL SPEED EC MOTOR","208-230/1/60",6,-20,53800,62100,"-",5750,"208-230/1/60",6.3,"-","-","-","-","-",0.625,2.125,1.125,15,20,"-","-",293,470,9,4.1500000000000004]
["H6L066DDA","HEAVY DUTY","HOT GAS - REVERSE CYCLE",2,"DUAL SPEED EC MOTOR","208-230/1/60",6,-20,66400,76600,"-",11850,"208-230/1/60",12.6,"-","-","-","-","-",0.625,2.125,1.125,15,20,"-","-",489,730,9,4.1500000000000004]
["H6L089DDA","HEAVY DUTY","HOT GAS - REVERSE CYCLE",2,"DUAL SPEED EC MOTOR","208-230/1/60",6,-20,89400,102300,"-",11730,"208-230/1/60",12.6,"-","-","-","-","-",0.875,3.125,1.125,15,20,"-","-",489,730,9,4.1500000000000004]
["H6L109DDA","HEAVY DUTY","HOT GAS - REVERSE CYCLE",2,"DUAL SPEED EC MOTOR","208-230/1/60",6,-20,109200,125700,"-",11500,"208-230/1/60",12.6,"-","-","-","-","-",0.875,3.125,1.125,15,20,"-","-",489,730,9,4.1500000000000004]
["H6L134DDA","HEAVY DUTY","HOT GAS - REVERSE CYCLE",3,"DUAL SPEED EC MOTOR","208-230/1/60",6,-20,134500,153800,"-",17600,"208-230/1/60",18.899999999999999,"-","-","-","-","-",1.125,3.125,1.375,20.5,25,"-","-",652,1000,9,4.1500000000000004]
["H6L163DDA","HEAVY DUTY","HOT GAS - REVERSE CYCLE",3,"DUAL SPEED EC MOTOR","208-230/1/60",6,-20,163500,188800,"-",17250,"208-230/1/60",18.899999999999999,"-","-","-","-","-",1.125,3.125,1.375,20.5,25,"-","-",652,1000,9,4.1500000000000004]
["H6L199DDA","HEAVY DUTY","HOT GAS - REVERSE CYCLE",4,"DUAL SPEED EC MOTOR","208-230/1/60",6,-20,199100,227400,"-",23000,"208-230/1/60",25.2,"-","-","-","-","-",1.125,3.125,1.375,26.8,30,"-","-",837,1130,9,4.1500000000000004]
["H4L035DDA","HEAVY DUTY","HOT GAS - REVERSE CYCLE",1,"DUAL SPEED EC MOTOR","208-230/1/60",4,-20,35800,41100,"-",5870,"208-230/1/60",6.3,"-","-","-","-","-",0.5,2.125,1.125,15,20,"-","-",293,470,"N/A",4.1500000000000004]
["H4L044DDA","HEAVY DUTY","HOT GAS - REVERSE CYCLE",1,"DUAL SPEED EC MOTOR","208-230/1/60",4,-20,44000,50800,"-",5750,"208-230/1/60",6.3,"-","-","-","-","-",0.625,2.125,1.125,15,20,"-","-",293,470,"N/A",4.1500000000000004]
["H4L071DDA","HEAVY DUTY","HOT GAS - REVERSE CYCLE",2,"DUAL SPEED EC MOTOR","208-230/1/60",4,-20,71400,83000,"-",11730,"208-230/1/60",12.6,"-","-","-","-","-",0.625,2.125,1.125,15,20,"-","-",489,730,"N/A",4.1500000000000004]
["H4L087DDA","HEAVY DUTY","HOT GAS - REVERSE CYCLE",2,"DUAL SPEED EC MOTOR","208-230/1/60",4,-20,87400,100900,"-",11500,"208-230/1/60",12.6,"-","-","-","-","-",0.875,3.125,1.125,15,20,"-","-",489,730,"N/A",4.1500000000000004]
["H4L107DDA","HEAVY DUTY","HOT GAS - REVERSE CYCLE",3,"DUAL SPEED EC MOTOR","208-230/1/60",4,-20,107700,122900,"-",17600,"208-230/1/60",18.899999999999999,"-","-","-","-","-",0.875,3.125,1.375,20.5,25,"-","-",652,1000,"N/A",4.1500000000000004]
["H4L131DDA","HEAVY DUTY","HOT GAS - REVERSE CYCLE",3,"DUAL SPEED EC MOTOR","208-230/1/60",4,-20,131900,152300,"-",17250,"208-230/1/60",18.899999999999999,"-","-","-","-","-",1.125,3.125,1.375,20.5,25,"-","-",652,1000,"N/A",4.1500000000000004]
["H4L167DDA","HEAVY DUTY","HOT GAS - REVERSE CYCLE",4,"DUAL SPEED EC MOTOR","208-230/1/60",4,-20,167000,190200,"-",23000,"208-230/1/60",25.2,"-","-","-","-","-",1.125,3.125,1.375,26.8,30,"-","-",837,1130,"N/A",4.1500000000000004]
["H6L033FDA","HEAVY DUTY","HOT GAS - REVERSE CYCLE",1,"DUAL SPEED EC MOTOR","460/1/60",6,-20,33100,38700,"-",5920,"460/1/60",3.1,"-","-","-","-","-",0.5,2.125,1.125,15,20,"-","-",293,470,9,4.1500000000000004]
["H6L044FDA","HEAVY DUTY","HOT GAS - REVERSE CYCLE",1,"DUAL SPEED EC MOTOR","460/1/60",6,-20,44500,50900,"-",5870,"460/1/60",3.1,"-","-","-","-","-",0.625,2.125,1.125,15,20,"-","-",293,470,9,4.1500000000000004]
["H6L053FDA","HEAVY DUTY","HOT GAS - REVERSE CYCLE",1,"DUAL SPEED EC MOTOR","460/1/60",6,-20,53800,62100,"-",5750,"460/1/60",3.1,"-","-","-","-","-",0.625,2.125,1.125,15,20,"-","-",293,470,9,4.1500000000000004]
["H6L066FDA","HEAVY DUTY","HOT GAS - REVERSE CYCLE",2,"DUAL SPEED EC MOTOR","460/1/60",6,-20,66400,76600,"-",11850,"460/1/60",6.2,"-","-","-","-","-",0.625,2.125,1.125,15,20,"-","-",489,730,9,4.1500000000000004]
["H6L089FDA","HEAVY DUTY","HOT GAS - REVERSE CYCLE",2,"DUAL SPEED EC MOTOR","460/1/60",6,-20,89400,102300,"-",11730,"460/1/60",6.2,"-","-","-","-","-",0.875,3.125,1.125,15,20,"-","-",489,730,9,4.1500000000000004]
["H6L109FDA","HEAVY DUTY","HOT GAS - REVERSE CYCLE",2,"DUAL SPEED EC MOTOR","460/1/60",6,-20,109200,125700,"-",11500,"460/1/60",6.2,"-","-","-","-","-",0.875,3.125,1.125,15,20,"-","-",489,730,9,4.1500000000000004]
["H6L134FDA","HEAVY DUTY","HOT GAS - REVERSE CYCLE",3,"DUAL SPEED EC MOTOR","460/1/60",6,-20,134500,153800,"-",17600,"460/1/60",9.3000000000000007,"-","-","-","-","-",1.125,3.125,1.375,15,20,"-","-",652,1000,9,4.1500000000000004]
["H6L163FDA","HEAVY DUTY","HOT GAS - REVERSE CYCLE",3,"DUAL SPEED EC MOTOR","460/1/60",6,-20,163500,188800,"-",17250,"460/1/60",9.3000000000000007,"-","-","-","-","-",1.125,3.125,1.375,15,20,"-","-",652,1000,9,4.1500000000000004]
["H6L199FDA","HEAVY DUTY","HOT GAS - REVERSE CYCLE",4,"DUAL SPEED EC MOTOR","460/1/60",6,-20,199100,227400,"-",23000,"460/1/60",12.4,"-","-","-","-","-",1.125,3.125,1.375,15,20,"-","-",837,1130,9,4.1500000000000004]
["H4L035FDA","HEAVY DUTY","HOT GAS - REVERSE CYCLE",1,"DUAL SPEED EC MOTOR","460/1/60",4,-20,35800,41100,"-",5870,"460/1/60",3.1,"-","-","-","-","-",0.5,2.125,1.125,15,20,"-","-",293,470,"N/A",4.1500000000000004]
["H4L044FDA","HEAVY DUTY","HOT GAS - REVERSE CYCLE",1,"DUAL SPEED EC MOTOR","460/1/60",4,-20,44000,50800,"-",5750,"460/1/60",3.1,"-","-","-","-","-",0.625,2.125,1.125,15,20,"-","-",293,470,"N/A",4.1500000000000004]
["H4L071FDA","HEAVY DUTY","HOT GAS - REVERSE CYCLE",2,"DUAL SPEED EC MOTOR","460/1/60",4,-20,71400,83000,"-",11730,"460/1/60",6.2,"-","-","-","-","-",0.625,2.125,1.125,15,20,"-","-",489,730,"N/A",4.1500000000000004]
["H4L087FDA","HEAVY DUTY","HOT GAS - REVERSE CYCLE",2,"DUAL SPEED EC MOTOR","460/1/60",4,-20,87400,100900,"-",11500,"460/1/60",6.2,"-","-","-","-","-",0.875,3.125,1.125,15,20,"-","-",489,730,"N/A",4.1500000000000004]
["H4L107FDA","HEAVY DUTY","HOT GAS - REVERSE CYCLE",3,"DUAL SPEED EC MOTOR","460/1/60",4,-20,107700,122900,"-",17600,"460/1/60",9.3000000000000007,"-","-","-","-","-",0.875,3.125,1.375,15,20,"-","-",652,1000,"N/A",4.1500000000000004]
["H4L131FDA","HEAVY DUTY","HOT GAS - REVERSE CYCLE",3,"DUAL SPEED EC MOTOR","460/1/60",4,-20,131900,152300,"-",17250,"460/1/60",9.3000000000000007,"-","-","-","-","-",1.125,3.125,1.375,15,20,"-","-",652,1000,"N/A",4.1500000000000004]
["H4L167FDA","HEAVY DUTY","HOT GAS - REVERSE CYCLE",4,"DUAL SPEED EC MOTOR","460/1/60",4,-20,167000,190200,"-",23000,"460/1/60",12.4,"-","-","-","-","-",1.125,3.125,1.375,15,20,"-","-",837,1130,"N/A",4.1500000000000004]
["H6T033DDA","HEAVY DUTY","THERMOBANK",1,"DUAL SPEED EC MOTOR","208-230/1/60",6,-20,33100,38700,"-",5920,"208-230/1/60",6.3,"-","-","-","-","-",0.5,2.125,1.125,15,20,"-","-",293,470,9,4.1500000000000004]
["H6T044DDA","HEAVY DUTY","THERMOBANK",1,"DUAL SPEED EC MOTOR","208-230/1/60",6,-20,44500,50900,"-",5870,"208-230/1/60",6.3,"-","-","-","-","-",0.625,2.125,1.125,15,20,"-","-",293,470,9,4.1500000000000004]
["H6T053DDA","HEAVY DUTY","THERMOBANK",1,"DUAL SPEED EC MOTOR","208-230/1/60",6,-20,53800,62100,"-",5750,"208-230/1/60",6.3,"-","-","-","-","-",0.625,2.125,1.125,15,20,"-","-",293,470,9,4.1500000000000004]
["H6T066DDA","HEAVY DUTY","THERMOBANK",2,"DUAL SPEED EC MOTOR","208-230/1/60",6,-20,66400,76600,"-",11850,"208-230/1/60",12.6,"-","-","-","-","-",0.625,2.125,1.125,15,20,"-","-",489,730,9,4.1500000000000004]
["H6T089DDA","HEAVY DUTY","THERMOBANK",2,"DUAL SPEED EC MOTOR","208-230/1/60",6,-20,89400,102300,"-",11730,"208-230/1/60",12.6,"-","-","-","-","-",0.875,3.125,1.125,15,20,"-","-",489,730,9,4.1500000000000004]
["H6T109DDA","HEAVY DUTY","THERMOBANK",2,"DUAL SPEED EC MOTOR","208-230/1/60",6,-20,109200,125700,"-",11500,"208-230/1/60",12.6,"-","-","-","-","-",0.875,3.125,1.125,15,20,"-","-",489,730,9,4.1500000000000004]
["H6T134DDA","HEAVY DUTY","THERMOBANK",3,"DUAL SPEED EC MOTOR","208-230/1/60",6,-20,134500,153800,"-",17600,"208-230/1/60",18.899999999999999,"-","-","-","-","-",1.125,3.125,1.375,20.5,25,"-","-",652,1000,9,4.1500000000000004]
["H6T163DDA","HEAVY DUTY","THERMOBANK",3,"DUAL SPEED EC MOTOR","208-230/1/60",6,-20,163500,188800,"-",17250,"208-230/1/60",18.899999999999999,"-","-","-","-","-",1.125,3.125,1.375,20.5,25,"-","-",652,1000,9,4.1500000000000004]
["H6T199DDA","HEAVY DUTY","THERMOBANK",4,"DUAL SPEED EC MOTOR","208-230/1/60",6,-20,199100,227400,"-",23000,"208-230/1/60",25.2,"-","-","-","-","-",1.125,3.125,1.375,26.8,30,"-","-",837,1130,9,4.1500000000000004]
["H4T035DDA","HEAVY DUTY","THERMOBANK",1,"DUAL SPEED EC MOTOR","208-230/1/60",4,-20,35800,41100,"-",5870,"208-230/1/60",6.3,"-","-","-","-","-",0.5,2.125,1.125,15,20,"-","-",293,470,"N/A",4.1500000000000004]
["H4T044DDA","HEAVY DUTY","THERMOBANK",1,"DUAL SPEED EC MOTOR","208-230/1/60",4,-20,44000,50800,"-",5750,"208-230/1/60",6.3,"-","-","-","-","-",0.625,2.125,1.125,15,20,"-","-",293,470,"N/A",4.1500000000000004]
["H4T071DDA","HEAVY DUTY","THERMOBANK",2,"DUAL SPEED EC MOTOR","208-230/1/60",4,-20,71400,83000,"-",11730,"208-230/1/60",12.6,"-","-","-","-","-",0.625,2.125,1.125,15,20,"-","-",489,730,"N/A",4.1500000000000004]
["H4T087DDA","HEAVY DUTY","THERMOBANK",2,"DUAL SPEED EC MOTOR","208-230/1/60",4,-20,87400,100900,"-",11500,"208-230/1/60",12.6,"-","-","-","-","-",0.875,3.125,1.125,15,20,"-","-",489,730,"N/A",4.1500000000000004]
["H4T107DDA","HEAVY DUTY","THERMOBANK",3,"DUAL SPEED EC MOTOR","208-230/1/60",4,-20,107700,122900,"-",17600,"208-230/1/60",18.899999999999999,"-","-","-","-","-",0.875,3.125,1.375,20.5,25,"-","-",652,1000,"N/A",4.1500000000000004]
["H4T131DDA","HEAVY DUTY","THERMOBANK",3,"DUAL SPEED EC MOTOR","208-230/1/60",4,-20,131900,152300,"-",17250,"208-230/1/60",18.899999999999999,"-","-","-","-","-",1.125,3.125,1.375,20.5,25,"-","-",652,1000,"N/A",4.1500000000000004]
["H4T167DDA","HEAVY DUTY","THERMOBANK",4,"DUAL SPEED EC MOTOR","208-230/1/60",4,-20,167000,190200,"-",23000,"208-230/1/60",25.2,"-","-","-","-","-",1.125,3.125,1.375,26.8,30,"-","-",837,1130,"N/A",4.1500000000000004]
["H6T033FDA","HEAVY DUTY","THERMOBANK",1,"DUAL SPEED EC MOTOR","460/1/60",6,-20,33100,38700,"-",5920,"460/1/60",3.1,"-","-","-","-","-",0.5,2.125,1.125,15,20,"-","-",293,470,9,4.1500000000000004]
["H6T044FDA","HEAVY DUTY","THERMOBANK",1,"DUAL SPEED EC MOTOR","460/1/60",6,-20,44500,50900,"-",5870,"460/1/60",3.1,"-","-","-","-","-",0.625,2.125,1.125,15,20,"-","-",293,470,9,4.1500000000000004]
["H6T053FDA","HEAVY DUTY","THERMOBANK",1,"DUAL SPEED EC MOTOR","460/1/60",6,-20,53800,62100,"-",5750,"460/1/60",3.1,"-","-","-","-","-",0.625,2.125,1.125,15,20,"-","-",293,470,9,4.1500000000000004]
["H6T066FDA","HEAVY DUTY","THERMOBANK",2,"DUAL SPEED EC MOTOR","460/1/60",6,-20,66400,76600,"-",11850,"460/1/60",6.2,"-","-","-","-","-",0.625,2.125,1.125,15,20,"-","-",489,730,9,4.1500000000000004]
["H6T089FDA","HEAVY DUTY","THERMOBANK",2,"DUAL SPEED EC MOTOR","460/1/60",6,-20,89400,102300,"-",11730,"460/1/60",6.2,"-","-","-","-","-",0.875,3.125,1.125,15,20,"-","-",489,730,9,4.1500000000000004]
["H6T109FDA","HEAVY DUTY","THERMOBANK",2,"DUAL SPEED EC MOTOR","460/1/60",6,-20,109200,125700,"-",11500,"460/1/60",6.2,"-","-","-","-","-",0.875,3.125,1.125,15,20,"-","-",489,730,9,4.1500000000000004]
["H6T134FDA","HEAVY DUTY","THERMOBANK",3,"DUAL SPEED EC MOTOR","460/1/60",6,-20,134500,153800,"-",17600,"460/1/60",9.3000000000000007,"-","-","-","-","-",1.125,3.125,1.375,15,20,"-","-",652,1000,9,4.1500000000000004]
["H6T163FDA","HEAVY DUTY","THERMOBANK",3,"DUAL SPEED EC MOTOR","460/1/60",6,-20,163500,188800,"-",17250,"460/1/60",9.3000000000000007,"-","-","-","-","-",1.125,3.125,1.375,15,20,"-","-",652,1000,9,4.1500000000000004]
["H6T199FDA","HEAVY DUTY","THERMOBANK",4,"DUAL SPEED EC MOTOR","460/1/60",6,-20,199100,227400,"-",23000,"460/1/60",12.4,"-","-","-","-","-",1.125,3.125,1.375,15,20,"-","-",837,1130,9,4.1500000000000004]
["H4T035FDA","HEAVY DUTY","THERMOBANK",1,"DUAL SPEED EC MOTOR","460/1/60",4,-20,35800,41100,"-",5870,"460/1/60",3.1,"-","-","-","-","-",0.5,2.125,1.125,15,20,"-","-",293,470,"N/A",4.1500000000000004]
["H4T044FDA","HEAVY DUTY","THERMOBANK",1,"DUAL SPEED EC MOTOR","460/1/60",4,-20,44000,50800,"-",5750,"460/1/60",3.1,"-","-","-","-","-",0.625,2.125,1.125,15,20,"-","-",293,470,"N/A",4.1500000000000004]
["H4T071FDA","HEAVY DUTY","THERMOBANK",2,"DUAL SPEED EC MOTOR","460/1/60",4,-20,71400,83000,"-",11730,"460/1/60",6.2,"-","-","-","-","-",0.625,2.125,1.125,15,20,"-","-",489,730,"N/A",4.1500000000000004]
["H4T087FDA","HEAVY DUTY","THERMOBANK",2,"DUAL SPEED EC MOTOR","460/1/60",4,-20,87400,100900,"-",11500,"460/1/60",6.2,"-","-","-","-","-",0.875,3.125,1.125,15,20,"-","-",489,730,"N/A",4.1500000000000004]
["H4T107FDA","HEAVY DUTY","THERMOBANK",3,"DUAL SPEED EC MOTOR","460/1/60",4,-20,107700,122900,"-",17600,"460/1/60",9.3000000000000007,"-","-","-","-","-",0.875,3.125,1.375,15,20,"-","-",652,1000,"N/A",4.1500000000000004]
["H4T131FDA","HEAVY DUTY","THERMOBANK",3,"DUAL SPEED EC MOTOR","460/1/60",4,-20,131900,152300,"-",17250,"460/1/60",9.3000000000000007,"-","-","-","-","-",1.125,3.125,1.375,15,20,"-","-",652,1000,"N/A",4.1500000000000004]
["H4T167FDA","HEAVY DUTY","THERMOBANK",4,"DUAL SPEED EC MOTOR","460/1/60",4,-20,167000,190200,"-",23000,"460/1/60",12.4,"-","-","-","-","-",1.125,3.125,1.375,15,20,"-","-",837,1130,"N/A",4.1500000000000004]

{"sheet":"All Temp Options","index":4,"n_rows":28,"n_cols":5,"rows_kept":28,"cut":false,"hidden":true,"merged":[]}
[]
[]
[]
[]
[]
[]
[]
[null,null,"Generic Option Name"]
[null,null,{"$f":"IF(OR(Submittal!F14=\"Hot Gas - 3 Pipe - Elec. Drain Pan\",Submittal!F14=\"Hot Gas - 3 Pipe - H.G. Drain Pain\",Submittal!F14=\"Hot Gas - Reverse Cycle - Elec. Drain Pan\",Submittal!F14=\"Hot Gas - Reverse Cycle - H.G. Drain Pain\",Submittal!F14=\"Thermobank\"),\"\",\"EcoNet\")","v":"EcoNet"}]
[null,null,{"$f":"IF(OR(Submittal!F14=\"Hot Gas - 3 Pipe - Elec. Drain Pan\",Submittal!F14=\"Hot Gas - 3 Pipe - H.G. Drain Pain\",Submittal!F14=\"Hot Gas - Reverse Cycle - Elec. Drain Pan\",Submittal!F14=\"Hot Gas - Reverse Cycle - H.G. Drain Pain\",Submittal!F14=\"Thermobank\"),\"\",\"EcoNet Command Center - Loose\")","v":"EcoNet Command Center - Loose"}]
[null,null,"Mechanical Thermostat - Mounted",null,"Hot Gas - 3 Pipe - Elec. Drain Pan"]
[null,null,"Electronic Room Thermostat - Mounted",null,"Hot Gas - 3 Pipe - H.G. Drain Pain"]
[null,null,"Thermostatic Expanion Valve - Mounted",null,"Hot Gas - Reverse Cycle - Elec. Drain Pan"]
[null,null,"Electronic Expansion Valve - Mounted",null,"Hot Gas - Reverse Cycle - H.G. Drain Pain"]
[null,null,"Liquid Line Solenoid Valve - Mounted"]
[null,null,"Mechanical Thermostat - Loose"]
[null,null,"Electronic Room Thermostat - Loose"]
[null,null,"Thermostatic Expansion Valve - Loose"]
[null,null,"Electronic Expanison Valve - Loose"]
[null,null,"Liquid Line Solenoid Valve - Loose"]
[null,null,{"$f":"IF(AND(OR(Submittal!F14=\"Electric\",Submittal!F14=\"Hot Gas - 3 Pipe - Elec. Drain Pan\",Submittal!F14=\"Hot Gas - 3 Pipe - H.G. Drain Pain\",Submittal!F14=\"Hot Gas - Reverse Cycle - Elec. Drain Pan\",Submittal!F14=\"Hot Gas - Reverse Cycle - H.G. Drain Pain\",Submittal!F14=\"Thermobank\"),OR(Submittal!I14=\"15\",Submittal!I14=\"10\",Submittal!I14=\"0\",Submittal!I14=\"-10\",Submittal!I14=\"-20\",Submittal!I14=\"-30\",Submittal!I14=\"-40\")),\"High-Static Fan Blades\",\"\")","v":""}]
[null,null,"Heat Exchanger HX-25 - Loose"]
[null,null,"Heat Exchanger HX-50 - Loose"]
[null,null,"Heat Exchanger HX-75 - Loose"]
[null,null,"Heat Exchanger HX-100 - Loose"]
[null,null,"Heat Exchanger HX-150 - Loose"]
[null,null,"Heat Exchanger HX-250 - Loose"]
[null,null,"Heat Exchanger HX-350 - Loose"]

{"sheet":"Pics","index":5,"n_rows":22,"n_cols":5,"rows_kept":22,"cut":false,"hidden":true,"merged":[]}
[]
[]
[]
[null,null,1]
[null,null,2]
[null,null,3]
[null,null,4]
[]
[]
[]
[]
[]
[]
[]
[]
[]
[]
[]
[null,null,null,null,"Russell"]
[null,null,null,null,"Witt"]
[null,null,null,null,"Kramer"]
[null,null,null,null,"ColdZone"]