{"text_format":"1","workbook":"xlsx","n_sheets":6,"sheets":["Submittal","Sheet1","REVISION","SUBMITTAL DATA","All Temp Options","Pics"],"not_rendered":{"charts":0,"images":17,"macros":1,"external_links":0,"defined_names":20,"comments":0,"pivot_tables":0},"unopened":[],"bounds":{"document_bytes":16777216,"sheet_cells":100000,"rows_first":2000,"rows_last":500,"rows_between":2000,"halvings":0,"cell_chars":16384,"cell_head_chars":4096},"cells_cut":0,"cells_raw":0,"read":"whole","date_system":"1900"}

{"sheet":"Submittal","index":0,"n_rows":98,"n_cols":41,"rows_kept":98,"cut":false,"hidden":false,"merged":[[71,16,71,17],[5,11,5,13],[5,0,5,7],[6,0,6,4],[7,0,7,4],[8,0,8,4],[6,11,6,13],[7,11,7,13],[8,11,8,13],[6,5,6,7],[7,5,7,7],[6,8,6,10],[7,8,7,10],[8,8,8,10],[8,5,8,7],[14,0,14,13],[10,5,10,7],[13,12,13,13],[12,5,12,7],[13,5,13,7],[9,11,9,13],[9,5,9,7],[10,11,10,13],[10,8,10,10],[12,10,12,11],[13,10,13,11],[9,8,9,10],[12,2,12,3],[13,2,13,3],[11,0,11,13],[12,0,12,1],[12,12,12,13],[13,0,13,1],[4,6,4,10],[4,12,4,13],[0,0,4,5],[0,6,0,10],[0,11,0,13],[1,6,1,10],[1,11,1,13],[2,6,2,10],[2,11,2,13],[3,6,3,10],[3,12,3,13],[5,8,5,10],[9,0,9,4],[15,0,29,13],[31,0,32,1],[33,0,33,1],[31,7,32,7],[31,6,32,6],[31,2,32,2],[31,8,32,8],[31,3,31,5],[31,9,32,9],[31,10,32,10],[31,11,32,11],[30,2,30,11],[30,13,32,13],[10,0,10,4],[43,0,43,13],[40,8,40,13],[41,8,41,13],[42,8,42,13],[40,6,42,7],[40,0,40,5],[41,0,41,5],[42,0,42,5],[39,0,39,13],[37,0,37,1],[35,0,36,1],[35,9,36,9],[35,10,36,10],[35,11,36,11],[35,12,36,12],[80,15,87,15],[3,17,3,30],[34,0,34,11],[49,0,49,1],[35,2,36,3],[37,2,37,3],[35,8,36,8],[35,6,36,7],[37,6,37,7],[35,4,36,4],[35,5,36,5],[38,0,38,13],[48,0,48,8],[44,0,44,13],[45,0,47,13],[50,0,50,1]]}
[null,null,null,null,null,null,"HEAT TRANSFER PRODUCTS GROUP, LLC",null,null,null,null,"SUBMITTAL DATA SHEET"]
[null,null,null,null,null,null,"3885 Crestwood Parkway / Suite 500",null,null,null,null,"HEAVY DUTY (W)",null,null,null,null,null,"HIGH STATIC",true]
[null,null,null,null,null,null,"Duluth, GA  30096",null,null,null,null,"UNIT COOLER"]
[null,null,null,null,null,null,"(P) 800-288-9488 / (F) 256-259-7478",null,null,null,null,null,"For Record Only",null,null,null,null,"T5 IS TEST FOR HIGH STATIC BECAUSE I WAS HAVING TROUBLE WITH DROP LIST SELECTION BEING STATIC AND CHANGING OPTOIN AND GETTING A FALSE VALID SELECTION"]
[null,null,null,null,null,null,"https://www.htpg.com/",null,null,null,null,null,"For Approval",null,null,null,null,null,null,{"$f":"IF(AND(T95>=1,'All Temp Options'!C21=\"\"),FALSE,TRUE)","v":true}]
[{"$f":"\"Rev. \"","v":"Rev. "},null,null,null,null,null,null,null,null,null,null,null,null,null,null,null,null,null,null,{"$f":"IF(T5=FALSE,FALSE,IF(T95=0,\"T\",\"H\"))","v":"T"}]
["Job Name:",null,null,null,null,null,null,null,"Job Location:"]
["Customer Name:"]
["Architect / Engineer:",null,null,null,null,null,null,null,"Prepared By:"]
["Unit Model Number:",null,null,null,null,{"$f":"IFERROR(R41,\"\")","v":""},null,null,"Tagging Info:"]
["Unit Quantity:",null,null,null,null,null,null,null,"Date:",null,null,{"$f":"TODAY()","v":"2024-07-31"}]
["Select unit attributes from the application option above and the drop down menus below to build required model number"]
["Brand",null,"Motor Type",null,"FPI","Defrost Type",null,null,"SST","Refrig.",{"$f":"\"R-\"&J14&\" Adjusted Capacity (BTUH) @ 10F TD\"","v":"R- Adjusted Capacity (BTUH) @ 10F TD"},null,"Unit Voltage"]
[]
["**clear all  fields when starting over**",null,null,null,null,null,null,null,null,null,null,null,null,null,null,null,"Russell","R","Dual Speed ECM","D",null,null,null,{"$f":"IF(OR(E14=\"\",E14=6),\"Air\",\"\")","v":"Air"},"A",4,null,"404A","A",null,{"$f":"IF(OR(F14=\"Electric- Medium Temperature\",F14=\"Electric- Low Temperature\"),\"208-230/3/60\",\"\")","v":""},"E"]
[null,null,null,null,null,null,null,null,null,null,null,null,null,null,null,null,"Witt","W"," "," ",null,null,null,{"$f":"IF(E14=6,\"Electric- Medium Temperature\",\"\")","v":""},"D",6,null,"407A","E",null,{"$f":"IF(OR(F14=\"AIR\",F14=\"Hot Gas - 3 Pipe - Elec. Drain Pan\",F14=\"Hot Gas - 3 Pipe - H.G. Drain Pain\",F14=\"Hot Gas - Reverse Cycle - Elec. Drain Pan\",F14=\"Hot Gas - Reverse Cycle - H.G. Drain Pain\",F14=\"Thermobank\"),\"208-230/1/60\",\"\")","v":""},"D"]
[null,null,null,null,null,null,null,null,null,null,null,null,null,null,null,null,"Kramer","K"," "," ",null,null,null,"Electric- Low Temperature","E",null,null,"448A","E",null,{"$f":"IF(OR(F14=\"Electric- Medium Temperature\",F14=\"Electric- Low Temperature\"),\"460/3/60\",\"\")","v":""},"G"]
[null,null,null,null,null,null,null,null,null,null,null,null,null,null,null,null,"ColdZone","C",null,null,null,null,null,"Hot Gas - 3 Pipe - Elec. Drain Pan","H",null,null,"449A","E",null,{"$f":"IF(OR(F14=\"AIR\",F14=\"Hot Gas - 3 Pipe - Elec. Drain Pan\",F14=\"Hot Gas - 3 Pipe - H.G. Drain Pain\",F14=\"Hot Gas - Reverse Cycle - Elec. Drain Pan\",F14=\"Hot Gas - Reverse Cycle - H.G. Drain Pain\",F14=\"Thermobank\"),\"460/1/60\",\"\")","v":""},"F",null,null," "]
[null,null,null,null,null,null,null,null,null,null,null,null,null,null,null,null,null,null,null,null,null,null,null,"Hot Gas - 3 Pipe - H.G. Drain Pain","K",null,null,"449B","E",null,{"$f":"IF(OR(F14=\"Electric- Medium Temperature\",F14=\"Electric- Low Temperature\"),\"575/3/60\",\"\")","v":""},"J"]
[null,null,null,null,null,null,null,null,null,null,null,null,null,null,null,null,null,null,null,null,null,null,null,"Hot Gas - Reverse Cycle - Elec. Drain Pan","G",null,null,null,null,null,{"$f":"IF(OR(F14=\"AIR\",F14=\"Hot Gas - 3 Pipe - Elec. Drain Pan\",F14=\"Hot Gas - 3 Pipe - H.G. Drain Pain\",F14=\"Hot Gas - Reverse Cycle - Elec. Drain Pan\",F14=\"Hot Gas - Reverse Cycle - H.G. Drain Pain\",F14=\"Thermobank\"),\"575/1/60\",\"\")","v":""},"H"]
[null,null,null,null,null,null,null,null,null,null,null,null,null,null,null,null,null,null,null,null,null,null,null,"Hot Gas - Reverse Cycle - H.G. Drain Pain","L"]
[null,null,null,null,null,null,null,null,null,null,null,null,null,null,null,null,null,null,null,null,null,null,null,{"$f":"IF(A14=\"KRAMER\",\"Thermobank\",\"\")","v":""},"T"]
[null,null,null,null,null,null,null,null,null,null,null,null,null,null,null,null,null,null,null,null,null,null,null,{"$f":"IF(A14=\"KRAMER\",\"Thermobank-Medium Temperature\",\"\")","v":""},"S"]
[null,null,null,null,null,null,null,null,null,null,null,null,null,null,null,null,null,null,null,null,null,null,null,"Hot Gas - 3 Pipe - Elec. Drain Pan MT","B"]
[null,null,null,null,null,null,null,null,null,null,null,null,null,null,null,null,null,null,null,null,null,null,null,"Hot Gas - 3 Pipe - H.G. Drain Pain MT","C"]
[null,null,null,null,null,null,null,null,null,null,null,null,null,null,null,null,null,null,null,null,null,null,null,"Hot Gas - Reverse Cycle - Elec. Drain Pan MT","M"]
[null,null,null,null,null,null,null,null,null,null,null,null,null,null,null,null,null,null,null,null,null,null,null,"Hot Gas - Reverse Cycle - H.G. Drain Pain MT","N",null,null,"shows 744 in list","No"]
[]
[]
[]
[null,null,"Physical Data",null,null,null,null,null,null,null,null,null,null,{"$f":"IF(I14=\"\",\"AWEF\",(IF(OR(I14=25,I14=20,I14=15,I14=10),\"AWEF COOLER\",\"AWEF FREEZER\")))","v":"AWEF"}]
["Base Model",null,"Fins/Inch","Refrig. Conn (ODS)",null,null,"Net Weight","Ship Weight ","Number of Fans","Air Throw","CFM","Fan Diameter"]
[null,null,null,"Liquid","Suction","Hot Gas"]
[{"$f":"IFERROR(\"W\"&E14&S38&T38,\"\")","v":""},null,{"$f":"IF(E14=0,\"\",E14)","v":""},{"$f":"IFERROR(VLOOKUP(S41,'SUBMITTAL DATA'!A2:AD1000,20,FALSE),\"\")","v":""},{"$f":"IFERROR(VLOOKUP(S41,'SUBMITTAL DATA'!A2:AD250,21,FALSE),\"\")","v":""},{"$f":"IFERROR(VLOOKUP(S41,'SUBMITTAL DATA'!A2:AD250,22,FALSE),\"\")","v":""},{"$f":"IFERROR(VLOOKUP(S41,'SUBMITTAL DATA'!A2:AD250,27,FALSE),\"\")","v":""},{"$f":"IFERROR(VLOOKUP(S41,'SUBMITTAL DATA'!A2:AD250,28,FALSE),\"\")","v":""},{"$f":"IFERROR(VLOOKUP(S41,'SUBMITTAL DATA'!A2:AD250,4,FALSE),\"\")","v":""},{"$f":"IF(F10=\"\",\"\",\"100'\")","v":""},{"$f":"IFERROR(VLOOKUP(S41,'SUBMITTAL DATA'!A2:AD250,12,FALSE),\"\")","v":""},{"$f":"IF(F10=\"\",\"\",\"30\"\"\")","v":""},null,{"$f":"IF(I14=\"\",\"0\",IF(OR(I14=25,I14=20,I14=15,I14=10),\"9.0\",\"4.15\"))","v":"0"}]
["Electrical Data"]
["Motor Voltage",null,"Total Motor Amps",null,{"$f":"IF(Q68>=1,\"EcoNet MCA\",\"Motor Circuit MCA\")","v":"Motor Circuit MCA"},{"$f":"IF(Q68>=1,\"EcoNet MOPD\",\"Motor Circuit MOPD\")","v":"Motor Circuit MOPD"},"Heater Voltage",null,"Number of Heater Circuits","Heater Amps Each Circuit","Total Heater Amps","Heater Watts"]
[null,null,null,null,null,null,null,null,null,null,null,null,null,null,null,null,"Brand",{"$f":"Submittal!A14","v":0},"Defrost","Capacity",null,"Voltage","Motor","Refrigerant"]
[{"$f":"IFERROR(VLOOKUP(S41,'SUBMITTAL DATA'!A2:AD250,13,FALSE),\"\")","v":""},null,{"$f":"IFERROR(VLOOKUP(S41,'SUBMITTAL DATA'!A2:AD250,14,FALSE),\"\")","v":""},null,{"$f":"IFERROR(VLOOKUP(S41,'SUBMITTAL DATA'!A2:AD250,IF(Q68>=1,25,23),FALSE),\"\")","v":""},{"$f":"IFERROR(VLOOKUP(S41,'SUBMITTAL DATA'!A2:AD250,IF(Q68>=1,26,24),FALSE),\"\")","v":""},{"$f":"IFERROR(VLOOKUP(S41,'SUBMITTAL DATA'!A2:AD250,15,FALSE),\"\")","v":""},null,{"$f":"IFERROR(VLOOKUP(S41,'SUBMITTAL DATA'!A2:AD250,16,FALSE),\"\")","v":""},{"$f":"IFERROR(VLOOKUP(S41,'SUBMITTAL DATA'!A2:AD250,18,FALSE),\"\")","v":""},{"$f":"IFERROR(VLOOKUP(S41,'SUBMITTAL DATA'!A2:AD250,18,FALSE),\"\")","v":""},{"$f":"IFERROR(VLOOKUP(S41,'SUBMITTAL DATA'!A2:AD250,19,FALSE),\"\")","v":""},null,null,null,null," ",{"$f":"VLOOKUP(R37,Q15:R18,2,FALSE)","v":{"$error":"#N/A"}},{"$f":"VLOOKUP(F14,X15:Y22,2,FALSE)","v":{"$error":"#N/A"}},{"$f":"IF(T39<100000,\"0\"&LEFT(T39,LEN(T39)-3),LEFT(T39,LEN(T39)-3))","v":{"$error":"#N/A"}},null,{"$f":"VLOOKUP(M14,AE15:AF21,2,FALSE)","v":{"$error":"#N/A"}},{"$f":"VLOOKUP(C14,S15:T16,2,FALSE)","v":{"$error":"#N/A"}},{"$f":"VLOOKUP($J$14,AB15:AC19,2,FALSE)","v":{"$error":"#N/A"}}]
[" ",null,null,null,null,null,null,null,null,null,null,null,null,null,null,null,null,null,null,{"$f":"R60","v":{"$error":"#N/A"}}]
["Options (Select catalog options from drop down menu.)",null,null,null,null,null,null,null,null,null,null,null,null,null,null,null,null,"Unit Model Num.","Lookup",null,null,null,null,"Temperature"]
{"$rows_left_out":59}
{"sheet":"Sheet1","index":1,"n_rows":0,"n_cols":0,"rows_kept":0,"cut":false,"hidden":true,"merged":[]}

{"sheet":"REVISION","index":2,"n_rows":7,"n_cols":3,"rows_kept":7,"cut":false,"hidden":true,"merged":[]}
[]
[1,"2020-07-29","INITIAL RELEASE"]
[1.01,"2020-08-25","corrected macro error, added additional notes field"]
[1.02,"2021-04-01","corrected an error with the look up table submittal - T48:U55"]
[1.03,"2023-08-25","Sloped Drain Pan"]
[1.04,"2023-11-28","Medium Temp Electric Defrost"]
[1.05,"2024-01-30","Adjust medium temp electric defrost models (-1)"]

{"sheet":"SUBMITTAL DATA","index":3,"n_rows":233,"n_cols":30,"rows_kept":233,"cut":false,"hidden":true,"merged":[]}
["LOOKUP","MODEL FAMILY","DEFROST TYPE","NUMBER OF FANS","MOTOR TYPE","UNIT VOLTAGE","FPI","SST","R404A CAPACITY","R407A/R448A/R449A CAPACITY",null,"CFM","MOTOR VOLTAGE","TOTAL UNIT FAN MOTOR AMPS","HEATER VOLTAGE","Number of Heater Circuits","HEATER AMPS EACH CIRCUIT","Total Heater Amps","HEATER WATTS","LIQUID LINE SIZE","SUCTION LINE SIZE","3-PIPE HG LINE","MCA - NO-ECONET","MOPD - NO-ECONET","MCA - ECONET","MOPD - ECONET","NET WEIGHT","APPROX. SHIP WEIGHT","AWEF CLR","AWEF FRZR"]
["H6D030EDA","HEAVY DUTY","ELECTRIC DEFROST - MT",1,"DUAL SPEED EC MOTOR","208-230/3/60",6,null,null,null,null,5920,"208-230/1/60",6.3,"208-230/3/60",1,{"$f":"R2/P2","v":14.4},14.4,6000,"1/2","1-1/8","-",15,20,16.399999999999999,20,"-",470,9,"N/A"]
["H6D042EDA","HEAVY DUTY","ELECTRIC DEFROST - MT",1,"DUAL SPEED EC MOTOR","208-230/3/60",6,null,null,null,null,5870,"208-230/1/60",6.3,"208-230/3/60",1,14.4,14.4,6000,"1/2","1-3/8","-",15,20,16.399999999999999,20,"-",470,9,"N/A"]
["H6D051EDA","HEAVY DUTY","ELECTRIC DEFROST - MT",1,"DUAL SPEED EC MOTOR","208-230/3/60",6,null,null,null,null,5750,"208-230/1/60",6.3,"208-230/3/60",1,14.4,14.4,6000,"5/8","1-5/8","-",15,20,16.399999999999999,20,"-",470,9,"N/A"]
["H6D062EDA","HEAVY DUTY","ELECTRIC DEFROST - MT",2,"DUAL SPEED EC MOTOR","208-230/3/60",6,null,null,null,null,11850,"208-230/1/60",12.6,"208-230/3/60",1,28.9,28.9,12000,"5/8","1-5/8","-",15,20,30.9,35,"-",730,9,"N/A"]
["H6D086EDA","HEAVY DUTY","ELECTRIC DEFROST - MT",2,"DUAL SPEED EC MOTOR","208-230/3/60",6,null,null,null,null,11730,"208-230/1/60",12.6,"208-230/3/60",1,28.9,28.9,12000,"7/8","2-1/8","-",15,20,30.9,35,"-",730,9,"N/A"]
["H6D104EDA","HEAVY DUTY","ELECTRIC DEFROST - MT",2,"DUAL SPEED EC MOTOR","208-230/3/60",6,null,null,null,null,11500,"208-230/1/60",12.6,"208-230/3/60",1,28.9,28.9,12000,"7/8","2-1/8","-",15,20,30.9,35,"-",730,9,"N/A"]
["H6D130EDA","HEAVY DUTY","ELECTRIC DEFROST - MT",3,"DUAL SPEED EC MOTOR","208-230/3/60",6,null,null,null,null,17600,"208-230/1/60",18.899999999999999,"208-230/3/60",1,43.3,43.3,18000,"7/8","2-1/8","-",20.5,25,45.3,50,"-",1000,9,"N/A"]
["H6D155EDA","HEAVY DUTY","ELECTRIC DEFROST - MT",3,"DUAL SPEED EC MOTOR","208-230/3/60",6,null,null,null,null,17250,"208-230/1/60",18.899999999999999,"208-230/3/60",1,43.3,43.3,18000,"1-1/8","2-1/8","-",20.5,25,45.3,50,"-",1000,9,"N/A"]
["H6D174EDA","HEAVY DUTY","ELECTRIC DEFROST - MT",4,"DUAL SPEED EC MOTOR","208-230/3/60",6,null,null,null,null,23000,"208-230/1/60",25.2,"208-230/3/60",2,28.85,57.7,24000,"1-1/8","2-1/8","-",26.8,30,59.7,60,"-",1130,9,"N/A"]
["H6D208EDA","HEAVY DUTY","ELECTRIC DEFROST - MT",4,"DUAL SPEED EC MOTOR","208-230/3/60",6,null,null,null,null,23000,"208-230/1/60",25.2,"208-230/3/60",2,28.85,57.7,24000,"1-1/8","2-1/8","-",26.8,30,59.7,60,"-",1130,9,"N/A"]
["H6D030GDA","HEAVY DUTY","ELECTRIC DEFROST - MT",1,"DUAL SPEED EC MOTOR","460/3/60",6,null,null,null,null,5920,"460/1/60",3.1,"460/3/60",1,7.5,7.5,6000,"1/2","1-1/8","-",15,20,15,20,"-",470,9,"N/A"]
["H6D042GDA","HEAVY DUTY","ELECTRIC DEFROST - MT",1,"DUAL SPEED EC MOTOR","460/3/60",6,null,null,null,null,5870,"460/1/60",3.1,"460/3/60",1,7.5,7.5,6000,"1/2","1-3/8","-",15,20,15,20,"-",470,9,"N/A"]
["H6D051GDA","HEAVY DUTY","ELECTRIC DEFROST - MT",1,"DUAL SPEED EC MOTOR","460/3/60",6,null,null,null,null,5750,"460/1/60",3.1,"460/3/60",1,7.5,7.5,6000,"5/8","1-5/8","-",15,20,15,20,"-",470,9,"N/A"]
["H6D062GDA","HEAVY DUTY","ELECTRIC DEFROST - MT",2,"DUAL SPEED EC MOTOR","460/3/60",6,null,null,null,null,11850,"460/1/60",6.2,"460/3/60",1,15.1,15.1,12000,"5/8","1-5/8","-",15,20,16.100000000000001,20,"-",730,9,"N/A"]
["H6D086GDA","HEAVY DUTY","ELECTRIC DEFROST - MT",2,"DUAL SPEED EC MOTOR","460/3/60",6,null,null,null,null,11730,"460/1/60",6.2,"460/3/60",1,15.1,15.1,12000,"7/8","2-1/8","-",15,20,16.100000000000001,20,"-",730,9,"N/A"]
["H6D104GDA","HEAVY DUTY","ELECTRIC DEFROST - MT",2,"DUAL SPEED EC MOTOR","460/3/60",6,null,null,null,null,11500,"460/1/60",6.2,"460/3/60",1,15.1,15.1,12000,"7/8","2-1/8","-",15,20,16.100000000000001,20,"-",730,9,"N/A"]
["H6D130GDA","HEAVY DUTY","ELECTRIC DEFROST - MT",3,"DUAL SPEED EC MOTOR","460/3/60",6,null,null,null,null,17600,"460/1/60",9.3000000000000007,"460/3/60",1,22.6,22.6,18000,"7/8","2-1/8","-",15,20,23.6,25,"-",1000,9,"N/A"]
["H6D155GDA","HEAVY DUTY","ELECTRIC DEFROST - MT",3,"DUAL SPEED EC MOTOR","460/3/60",6,null,null,null,null,17250,"460/1/60",9.3000000000000007,"460/3/60",1,22.6,22.6,18000,"1-1/8","2-1/8","-",15,20,23.6,25,"-",1000,9,"N/A"]
["H6D174GDA","HEAVY DUTY","ELECTRIC DEFROST - MT",4,"DUAL SPEED EC MOTOR","460/3/60",6,null,null,null,null,23000,"460/1/60",12.4,"460/3/60",1,30.1,30.1,24000,"1-1/8","2-1/8","-",15,20,31.1,35,"-",1130,9,"N/A"]
["H6D208GDA","HEAVY DUTY","ELECTRIC DEFROST - MT",4,"DUAL SPEED EC MOTOR","460/3/60",6,null,null,null,null,23000,"460/1/60",12.4,"460/3/60",1,30.1,30.1,24000,"1-1/8","2-1/8","-",15,20,31.1,35,"-",1130,9,"N/A"]
["H6A031DDA","HEAVY DUTY","AIR DEFROST",1,"DUAL SPEED EC MOTOR","208-230/1/60",6,null,null,null,null,5920,"208-230/1/60",6.3,"-","-",null,"-","-","1/2",1.125,null,15,20,15,20,"-",470,9,"-"]
["H6A043DDA","HEAVY DUTY","AIR DEFROST",1,"DUAL SPEED EC MOTOR","208-230/1/60",6,null,null,null,null,5870,"208-230/1/60",6.3,"-","-",null,"-","-","1/2",1.375,null,15,20,15,20,"-",470,9,"-"]
["H6A052DDA","HEAVY DUTY","AIR DEFROST",1,"DUAL SPEED EC MOTOR","208-230/1/60",6,null,null,null,null,5750,"208-230/1/60",6.3,"-","-",null,"-","-",0.625,1.625,null,15,20,15,20,"-",470,9,"-"]
["H6A063DDA","HEAVY DUTY","AIR DEFROST",2,"DUAL SPEED EC MOTOR","208-230/1/60",6,null,null,null,null,11850,"208-230/1/60",12.6,"-","-",null,"-","-",0.625,1.625,null,15,20,16.2,20,"-",730,9,"-"]
["H6A087DDA","HEAVY DUTY","AIR DEFROST",2,"DUAL SPEED EC MOTOR","208-230/1/60",6,null,null,null,null,11730,"208-230/1/60",12.6,"-","-",null,"-","-",0.875,2.125,null,15,20,16.2,20,"-",730,9,"-"]
["H6A105DDA","HEAVY DUTY","AIR DEFROST",2,"DUAL SPEED EC MOTOR","208-230/1/60",6,null,null,null,null,11500,"208-230/1/60",12.6,"-","-",null,"-","-",0.875,2.125,null,15,20,16.2,20,"-",730,9,"-"]
["H6A132DDA","HEAVY DUTY","AIR DEFROST",3,"DUAL SPEED EC MOTOR","208-230/1/60",6,null,null,null,null,17600,"208-230/1/60",18.899999999999999,"-","-",null,"-","-",0.875,2.125,null,20.5,25,22.5,25,"-",1000,9,"-"]
["H6A156DDA","HEAVY DUTY","AIR DEFROST",3,"DUAL SPEED EC MOTOR","208-230/1/60",6,null,null,null,null,17250,"208-230/1/60",18.899999999999999,"-","-",null,"-","-",1.125,2.125,null,20.5,25,22.5,25,"-",1000,9,"-"]
["H6A175DDA","HEAVY DUTY","AIR DEFROST",4,"DUAL SPEED EC MOTOR","208-230/1/60",6,null,null,null,null,23460,"208-230/1/60",25.2,"-","-",null,"-","-",1.125,2.125,null,26.8,30,28.8,30,"-",1130,9,"-"]
["H6A209DDA","HEAVY DUTY","AIR DEFROST",4,"DUAL SPEED EC MOTOR","208-230/1/60",6,null,null,null,null,23000,"208-230/1/60",25.2,"-","-",null,"-","-",1.125,2.125,null,26.8,30,28.8,30,"-",1130,9,"-"]
["H6A031FDA","HEAVY DUTY","AIR DEFROST",1,"DUAL SPEED EC MOTOR","460/1/60",6,null,null,null,null,5920,"460/1/60",3.1,"-","-",null,"-","-","1/2",1.125,null,15,20,15,20,"-",470,9,"-"]
["H6A043FDA","HEAVY DUTY","AIR DEFROST",1,"DUAL SPEED EC MOTOR","460/1/60",6,null,null,null,null,5870,"460/1/60",3.1,"-","-",null,"-","-","1/2",1.375,null,15,20,15,20,"-",470,9,"-"]
["H6A052FDA","HEAVY DUTY","AIR DEFROST",1,"DUAL SPEED EC MOTOR","460/1/60",6,null,null,null,null,5750,"460/1/60",3.1,"-","-",null,"-","-",0.625,1.625,null,15,20,15,20,"-",470,9,"-"]
["H6A063FDA","HEAVY DUTY","AIR DEFROST",2,"DUAL SPEED EC MOTOR","460/1/60",6,null,null,null,null,11850,"460/1/60",6.2,"-","-",null,"-","-",0.625,1.625,null,15,20,15,20,"-",730,9,"-"]
["H6A087FDA","HEAVY DUTY","AIR DEFROST",2,"DUAL SPEED EC MOTOR","460/1/60",6,null,null,null,null,11730,"460/1/60",6.2,"-","-",null,"-","-",0.875,2.125,null,15,20,15,20,"-",730,9,"-"]
["H6A105FDA","HEAVY DUTY","AIR DEFROST",2,"DUAL SPEED EC MOTOR","460/1/60",6,null,null,null,null,11500,"460/1/60",6.2,"-","-",null,"-","-",0.875,2.125,null,15,20,15,20,"-",730,9,"-"]
["H6A132FDA","HEAVY DUTY","AIR DEFROST",3,"DUAL SPEED EC MOTOR","460/1/60",6,null,null,null,null,17600,"460/1/60",9.3000000000000007,"-","-",null,"-","-",0.875,2.125,null,15,20,15,20,"-",1000,9,"-"]
["H6A156FDA","HEAVY DUTY","AIR DEFROST",3,"DUAL SPEED EC MOTOR","460/1/60",6,null,null,null,null,17250,"460/1/60",9.3000000000000007,"-","-",null,"-","-",1.125,2.125,null,15,20,15,20,"-",1000,9,"-"]
["H6A175FDA","HEAVY DUTY","AIR DEFROST",4,"DUAL SPEED EC MOTOR","460/1/60",6,null,null,null,null,23460,"460/1/60",12.4,"-","-",null,"-","-",1.125,2.125,null,15,20,15,20,"-",1130,9,"-"]
{"$rows_left_out":194}
{"sheet":"All Temp Options","index":4,"n_rows":28,"n_cols":5,"rows_kept":28,"cut":false,"hidden":true,"merged":[]}
[]
[]
[]
[]
[]
[]
[]
[null,null,"Generic Option Name"]
[null,null,{"$f":"IF(OR(Submittal!F14=\"Hot Gas - 3 Pipe - Elec. Drain Pan\",Submittal!F14=\"Hot Gas - 3 Pipe - H.G. Drain Pain\",Submittal!F14=\"Hot Gas - Reverse Cycle - Elec. Drain Pan\",Submittal!F14=\"Hot Gas - Reverse Cycle - H.G. Drain Pain\",Submittal!F14=\"Thermobank\"),\"\",\"EcoNet\")","v":"EcoNet"}]
[null,null,{"$f":"IF(OR(Submittal!F14=\"Hot Gas - 3 Pipe - Elec. Drain Pan\",Submittal!F14=\"Hot Gas - 3 Pipe - H.G. Drain Pain\",Submittal!F14=\"Hot Gas - Reverse Cycle - Elec. Drain Pan\",Submittal!F14=\"Hot Gas - Reverse Cycle - H.G. Drain Pain\",Submittal!F14=\"Thermobank\"),\"\",\"EcoNet Command Center - Loose\")","v":"EcoNet Command Center - Loose"}]
[null,null,"Mechanical Thermostat - Mounted",null,"Hot Gas - 3 Pipe - Elec. Drain Pan"]
[null,null,"Electronic Room Thermostat - Mounted",null,"Hot Gas - 3 Pipe - H.G. Drain Pain"]
[null,null,"Thermostatic Expanion Valve - Mounted",null,"Hot Gas - Reverse Cycle - Elec. Drain Pan"]
[null,null,"Electronic Expansion Valve - Mounted",null,"Hot Gas - Reverse Cycle - H.G. Drain Pain"]
[null,null,"Liquid Line Solenoid Valve - Mounted"]
[null,null,"Mechanical Thermostat - Loose"]
[null,null,"Electronic Room Thermostat - Loose"]
[null,null,"Thermostatic Expansion Valve - Loose"]
[null,null,"Electronic Expanison Valve - Loose"]
[null,null,"Liquid Line Solenoid Valve - Loose"]
[null,null,{"$f":"IF(AND(OR(Submittal!F14=\"Electric\",Submittal!F14=\"Hot Gas - 3 Pipe - Elec. Drain Pan\",Submittal!F14=\"Hot Gas - 3 Pipe - H.G. Drain Pain\",Submittal!F14=\"Hot Gas - Reverse Cycle - Elec. Drain Pan\",Submittal!F14=\"Hot Gas - Reverse Cycle - H.G. Drain Pain\",Submittal!F14=\"Thermobank\"),OR(Submittal!I14=\"15\",Submittal!I14=\"10\",Submittal!I14=\"0\",Submittal!I14=\"-10\",Submittal!I14=\"-20\",Submittal!I14=\"-30\",Submittal!I14=\"-40\")),\"High-Static Fan Blades\",\"\")","v":""}]
[null,null,"Heat Exchanger HX-25 - Loose"]
[null,null,"Heat Exchanger HX-50 - Loose"]
[null,null,"Heat Exchanger HX-75 - Loose"]
[null,null,"Heat Exchanger HX-100 - Loose"]
[null,null,"Heat Exchanger HX-150 - Loose"]
[null,null,"Heat Exchanger HX-250 - Loose"]
[null,null,"Heat Exchanger HX-350 - Loose"]

{"sheet":"Pics","index":5,"n_rows":22,"n_cols":5,"rows_kept":22,"cut":false,"hidden":true,"merged":[]}
[]
[]
[]
[null,null,1]
[null,null,2]
[null,null,3]
[null,null,4]
[]
[]
[]
[]
[]
[]
[]
[]
[]
[]
[]
[null,null,null,null,"Russell"]
[null,null,null,null,"Witt"]
[null,null,null,null,"Kramer"]
[null,null,null,null,"ColdZone"]