{"text_format":"1","workbook":"xlsx","n_sheets":8,"sheets":["Submital","Sheet3","Sheet2","Sheet1","REVISION","SUBMITTAL DATA","All Temp Options","Pics"],"not_rendered":{"charts":0,"images":11,"macros":1,"external_links":0,"defined_names":20,"comments":1,"pivot_tables":0},"unopened":[],"bounds":{"document_bytes":16777216,"sheet_cells":100000,"rows_first":2000,"rows_last":500,"rows_between":2000,"halvings":0,"cell_chars":16384,"cell_head_chars":4096},"cells_cut":0,"cells_raw":0,"read":"whole","date_system":"1900"}

{"sheet":"Submital","index":0,"n_rows":72,"n_cols":36,"rows_kept":72,"cut":false,"hidden":false,"merged":[[20,35,22,35],[18,35,19,35],[23,35,24,35],[31,10,32,10],[30,13,32,13],[31,11,32,11],[30,2,30,11],[31,8,32,8],[35,2,36,3],[33,0,33,1],[31,7,32,7],[31,6,32,6],[31,2,32,2],[31,3,31,5],[49,0,49,1],[50,0,50,1],[34,0,34,10],[39,0,39,13],[37,0,37,1],[35,0,36,1],[35,9,36,9],[43,0,43,13],[40,8,40,13],[41,8,41,13],[42,8,42,13],[40,6,42,7],[40,0,40,5],[41,0,41,5],[48,0,48,8],[42,0,42,5],[4,6,4,10],[4,12,4,13],[0,0,4,5],[0,6,0,10],[0,11,0,13],[1,6,1,10],[1,11,1,13],[2,6,2,10],[2,11,2,13],[3,6,3,10],[3,12,3,13],[13,12,13,13],[6,11,6,13],[7,11,7,13],[8,11,8,13],[6,5,6,7],[7,5,7,7],[6,8,6,10],[7,8,7,10],[8,8,8,10],[8,5,8,7],[9,11,9,13],[9,5,9,7],[12,5,12,6],[13,5,13,6],[8,0,8,4],[10,11,10,13],[10,8,10,10],[9,8,9,10],[10,5,10,7],[5,8,5,10],[5,11,5,13],[5,0,5,7],[14,0,14,13],[9,0,9,4],[10,0,10,4],[12,2,12,3],[13,2,13,3],[11,0,11,13],[12,0,12,1],[12,12,12,13],[12,9,12,11],[6,0,6,4],[7,0,7,4],[13,0,13,1],[13,9,13,11],[16,19,16,25],[16,26,16,32],[46,16,46,17],[46,19,46,20],[37,2,37,3],[38,0,38,13],[35,8,36,8],[35,6,36,7],[37,6,37,7],[35,4,36,4],[35,5,36,5],[44,0,44,13],[45,0,47,13],[31,9,32,9],[15,0,29,13],[31,0,32,1]]}
[null,null,null,null,null,null,"HEAT TRANSFER PRODUCTS GROUP, LLC",null,null,null,null,"SUBMITTAL DATA SHEET",null,null,null,null,null,null,{"$f":"IF(OR(H14=25,H14=20,H14=10),30,31)","v":31},"AWEF COOLER or FREEZER"]
[null,null,null,null,null,null,"3885 Crestwood Parkway / Suite 500",null,null,null,null,"MEDIUM PROFILE",null,null,null,null,"RM6A276DDA",null,null,null,null,null,null,null,"shows 744 in list","No"]
[null,null,null,null,null,null,"Duluth, GA  30096",null,null,null,null,"UNIT COOLER"]
[null,null,null,null,null,null,"(P) 800-288-9488 / (F) 256-259-7478",null,null,null,null,null,"For Record Only"]
[null,null,null,null,null,null,"https://www.htpg.com/",null,null,null,null,null,"For Approval"]
[{"$f":"\"Rev. \"","v":"Rev. "},null,null,null,null,null,null,null,null,null,null,null,null,null,null,null,"Russell","R","Dual Speed ECM","D",4,null,{"$f":"IF(OR(E14=\"\",E14=6),\"Air\",\"\")","v":"Air"},null,{"$f":"IF(OR(S12=\"A\",S12=\"H\",S12=\"G\"),\"115/1/60\",\"\")","v":"115/1/60"},"A","404A","A"]
["Job Name:",null,null,null,null,null,null,null,"Job Location:",null,null,null,null,null,null,null,"Witt","W",null,null,6,null,"Electric-LT",null,{"$f":"IF(OR(S12=\"E\",S12=\"D\",S12=\"A\",S12=\"G\",S12=\"H\",S12=\"D\",OR(T12=181,T12=211,T12=219,T12=258,T12=275,T12=323,T12=323,T12=369,T12=431,T12=441,T12=519,T12=110,T12=143,T12=232,T12=288,T12=124,T12=162,T12=261,T12=327)),\"208-230/1/60\",\"\")","v":{"$error":"#N/A"}},"D","407A","E"]
["Customer Name:",null,null,null,null,null,null,null,"Order Number:",null,null,null,null,null,null,null,"Kramer","K",null,null,null,null,{"$f":"IF(OR(E14=\"\",E14=6),\"Electric-MT\",\"\")","v":"Electric-MT"},null,{"$f":"IF(OR(S12=\"D\",S12=\"E\"),\"208-230/3/60\",\"\")","v":""},"E","448A","E"]
["Architect / Engineer:",null,null,null,null,null,null,null,"Prepared By:",null,null,null,null,null,null,null,"ColdZone","C",null,null,null,null,"Hot Gas - 3 Pipe",null,{"$f":"IF(OR(S12=\"D\",S12=\"E\",S12=\"A\",S12=\"H\",S12=\"G\"),\"460/1/60\",\"\")","v":"460/1/60"},"F","449A","E"]
["Unit Model Number:",null,null,null,null,{"$f":"IFERROR(R15,\"\")","v":""},null,null,"Tagging Info:",null,null,null,null,null,null,null,null,null,null,null,null,null,"Hot Gas - Reverse Cycle",null,{"$f":"IF(OR(S12=\"D\",S12=\"E\"),\"460/3/60\",\"\")","v":""},"G","449B","E"]
["Unit Quantity:",null,null,null,null,null,null,null,"Date:",null,null,null,null,null,null,null,"Brand",{"$f":"Submital!A14","v":0},"Defrost","Capacity",null,"Voltage","Motor","Refrigerant"]
["Select unit attributes from the application option above and the drop down menus below to build required model number",null,null,null,null,null,null,null,null,null,null,null,null,null,null,null,null,{"$f":"VLOOKUP(R11,Q6:R9,2,FALSE)","v":{"$error":"#N/A"}},{"$f":"IF(F14=\"Air\",\"A\",IF(F14=\"Electric-LT\",\"E\",IF(F14=\"Electric-MT\", \"D\",IF(F14=\"Hot Gas - 3 Pipe\",\"H\",\"G\"))))","v":"G"},{"$f":"LEFT(T13,LEN(T13)-2)","v":{"$error":"#N/A"}},null,{"$f":"VLOOKUP(M14,Y6:Z10,2,FALSE)","v":{"$error":"#N/A"}},{"$f":"VLOOKUP(C14,S6:T8,2,FALSE)","v":{"$error":"#N/A"}},{"$f":"VLOOKUP($I$14,AA6:AB10,2,FALSE)","v":{"$error":"#N/A"}}]
["Brand",null,"Motor Type",null,"Fins/In","Defrost Type",null,"SST","Refrig.",{"$f":"\"R-\"&I14&\" Capacity (BTUH) @ 10TD\"","v":"R- Capacity (BTUH) @ 10TD"},null,null,"Unit Voltage",null,null,null,null,null,null,{"$f":"IF(J14<10000,\"0\"&R35,R35)","v":{"$error":"#N/A"}}]
[null,null,null,null,null,null,null,null,null,null,null,null,null,null,null,null,null,"Unit Model Number","Lookup"]
["**clear all  fields when starting over**",null,null,null,null,null,null,null,null,null,null,null,null,null,null,null,null,{"$f":"R12&\"M\"&E14&S12&T12&V12&W12&\"A\"","v":{"$error":"#N/A"}},{"$f":"\"M\"&E14&S12&T12&V12&W12&\"A\"","v":{"$error":"#N/A"}},null,null,null,null,"Temperature"]
[null,null,null,null,null,null,null,null,null,null,null,null,null,null,null,null,null,null,null,null,null,null,null,{"$f":"VLOOKUP(S15,'SUBMITTAL DATA'!A2:I114,9,FALSE)","v":{"$error":"#N/A"}}]
[null,null,null,null,null,null,null,null,null,null,null,null,null,null,null,null,null,null,null,404,null,null,null,null,null,null,448,null,null,null,null,null,null,404,448]
[null,null,null,null,null,null,null,null,null,null,null,null,null,null,null,null,"HG CAP TABLE IF SELECTED","404a CAP TABLE",null,"L4E","L6E","M6A","L4P","L6P","L4R","L6R","4E","6E","M6A","4P","6P","4R","6R","M6E","M6E"]
[null,null,null,null,null,null,null,null,null,null,null,null,null,null,null,1,{"$f":"ROUND((VLOOKUP(P19,$S$19:$AI$34,$R$71,FALSE)*100)*IF($U$66=1,VLOOKUP($H$14,$X$42:$Y$49,2,FALSE),1),0)","v":{"$error":"#REF!"}},{"$f":"VLOOKUP(P19,$S$19:$AI$34,$U$56,FALSE)*100","v":{"$error":"#REF!"}},1,"110","153","182","110","153","110","153","124","174","211","124","174","124","174",181,"211",1]
[null,null,null,null,null,null,null,null,null,null,null,null,null,null,null,2,{"$f":"ROUND((VLOOKUP(P20,$S$19:$AI$34,$R$71,FALSE)*100)*IF($U$66=1,VLOOKUP($H$14,$X$42:$Y$49,2,FALSE),1),0)","v":{"$error":"#REF!"}},{"$f":"VLOOKUP(P20,$S$19:$AI$34,$U$56,FALSE)*100","v":{"$error":"#REF!"}},2,"143","184","220","143","184","143","184","162","211","258","162","211","162","211",219,"258"]
[null,null,null,null,null,null,null,null,null,null,null,null,null,null,null,3,{"$error":"#REF!"},{"$error":"#REF!"},3,"232","311","276","232","311","232","311","261","357","323","261","357","261","357",275,"323",2]
[null,null,null,null,null,null,null,null,null,null,null,null,null,null,null,4,{"$error":"#REF!"},{"$error":"#REF!"},4,"288","374","370","288","374","288","374","327","429","431","327","429","327","429",369,"431"]
[null,null,null,null,null,null,null,null,null,null,null,null,null,null,null,5,{"$error":"#REF!"},{"$error":"#REF!"},5,"336","469","442","336","469","336","469","383","536","519","383","536","383","536",441,"519"]
[null,null,null,null,null,null,null,null,null,null,null,null,null,null,null,6,{"$error":"#REF!"},{"$error":"#REF!"},6,"419","564","549","419","564","419","564","476","643","642","476","643","476","643",548,"642",3]
[null,null,null,null,null,null,null,null,null,null,null,null,null,null,null,7,{"$error":"#REF!"},{"$error":"#REF!"},7,null,null,"658",null,null,null,null,null,null,"769",null,null,null,null,657,"769"]
[null,null,null,null,null,null,null,null,null,null,null,null,null,null,null,8,{"$error":"#REF!"},{"$error":"#REF!"},8]
[null,null,null,null,null,null,null,null,null,null,null,null,null,null,null,9,{"$error":"#REF!"},{"$error":"#REF!"},9]
[null,null,null,null,null,null,null,null,null,null,null,null,null,null,null,10,{"$error":"#REF!"},{"$error":"#REF!"},10]
[null,null,null,null,null,null,null,null,null,null,null,null,null,null,null,11,{"$error":"#REF!"},{"$error":"#REF!"},11]
[null,null,null,null,null,null,null,null,null,null,null,null,null,null,null,12,{"$error":"#REF!"},{"$error":"#REF!"},12]
[null,null,"Physical Data",null,null,null,null,null,null,null,null,null,null,{"$f":"IF(H14=\"\",\"AWEF\",(IF(OR(H14=25,H14=20,H14=10),\"AWEF COOLER\",\"AWEF FREEZER\")))","v":"AWEF"},null,13,{"$error":"#REF!"},{"$error":"#REF!"},13]
["Base Model",null,"Fins/Inch","Refrig. Conn (ODS)",null,null,"Net Weight","Ship Weight ","Number of Fans","Air Throw","CFM","Fan Diameter",null,null,null,14,{"$error":"#REF!"},{"$error":"#REF!"},14]
[null,null,null,"Liquid","Suction","Hot Gas",null,null,null,null,null,null,null,null,null,15,{"$error":"#REF!"},{"$error":"#REF!"},15]
[{"$f":"IFERROR(\"M\"&E14&S12&T12,\"\")","v":""},null,{"$f":"IF(E14=0,\"\",E14)","v":""},{"$f":"IFERROR(VLOOKUP(S15,'SUBMITTAL DATA'!A2:AE300,21,FALSE),\"\")","v":""},{"$f":"IFERROR(VLOOKUP(S15,'SUBMITTAL DATA'!A2:AE300,22,FALSE),\"\")","v":""},{"$f":"IFERROR(VLOOKUP(S15,'SUBMITTAL DATA'!A2:AE300,23,FALSE),\"\")","v":""},{"$f":"IFERROR(VLOOKUP(S15,'SUBMITTAL DATA'!A2:AE300,28,FALSE),\"\")","v":""},{"$f":"IFERROR(VLOOKUP(S15,'SUBMITTAL DATA'!A2:AE300,29,FALSE),\"\")","v":""},{"$f":"IFERROR(VLOOKUP(S15,'SUBMITTAL DATA'!A2:AE300,5,FALSE),\"\")","v":""},{"$f":"IF(F10=\"\",\"\",\"75'\")","v":""},{"$f":"IFERROR(VLOOKUP(S15,'SUBMITTAL DATA'!A2:O300,15,FALSE),\"\")","v":""},{"$f":"IF(F10=\"\",\"\",\"24\"\"\")","v":""},null,{"$f":"IF(H14=\"\",\"\",IFERROR(VLOOKUP(S15,'SUBMITTAL DATA'!A2:AE300,IF(OR(H14=25,H14=20,H14=10),30,31),FALSE),\"\"))","v":""},null,16,{"$error":"#REF!"},{"$error":"#REF!"},16]
["Electrical Data",null,null,null,null,null,null,null,null,null,null,null,null,null,null,null,null,{"$f":"VLOOKUP(J14,$Q$19:$R$34,2,FALSE)","v":{"$error":"#N/A"}},null,1,2,3,5,6,7,8,9,10,11,12,13,14,15,16,17]
["Motor Voltage",null,"Total Motor Amps",null,{"$f":"IF(Q43>=1,\"EcoNet MCA\",\"Motor Circuit MCA\")","v":"Motor Circuit MCA"},{"$f":"IF(Q43>=1,\"EcoNet MOPD\",\"Motor Circuit MOPD\")","v":"Motor Circuit MOPD"},"Heater Voltage",null,"Heater Amps","Heater Watts"]
[]
[{"$f":"IFERROR(VLOOKUP(S15,'SUBMITTAL DATA'!A2:AE300,16,FALSE),\"\")","v":""},null,{"$f":"IFERROR(VLOOKUP(S15,'SUBMITTAL DATA'!A2:AE300,17,FALSE),\"\")","v":""},null,{"$f":"IFERROR(VLOOKUP(S15,'SUBMITTAL DATA'!A2:AE300,IF(Q43>=1,26,24),FALSE),\"\")","v":""},{"$f":"IFERROR(VLOOKUP(S15,'SUBMITTAL DATA'!A2:AE300,IF(Q43>=1,27,25),FALSE),\"\")","v":""},{"$f":"IFERROR(VLOOKUP(S15,'SUBMITTAL DATA'!A2:AE300,18,FALSE),\"\")","v":""},null,{"$f":"IFERROR(VLOOKUP(S15,'SUBMITTAL DATA'!A2:AE300,19,FALSE),\"\")","v":""},{"$f":"IFERROR(VLOOKUP(S15,'SUBMITTAL DATA'!A2:AE300,20,FALSE),\"\")","v":""}]
[{"$f":"IF(K38=\"\",\"\",IF(K38=\"N/A\",\"PLEASE NOTE - THE SELECTED PRODUCT DOES NOT MEET AWEF REQUIREMENTS AT THE DEFINED CONDITIONS AND CANNOT BE USED FOR APPLICATIONS SMALLER THAN 3,000 SQ. FT.\",\"\"))","v":""}]
["Options (Select catalog options from drop down menu.)",null,null,null,null,null,null,null,null,null,null,null,null,null,null,null,null,null,null,null,null,null,null,null,{"$f":"IF(AND(OR(S12=\"E\",S12=\"D\",S12=\"H\",F12=\"G\",S12=\"A\"),OR(I14=AA6,I14=AA7,I14=AA8,I14=AA9,I14=AA10)),AA6)","v":false}]
[null,null,null,null,null,null,{"$f":"IF(U43=1,\"CONFIGURATION CONFLICT\",\"\")","v":""}]
[null,null,null,null,null,null,null,null,null,null,null,null,null,null,null,null,"FOR ECONET ELECTRICAL",null,null,"FOR SHEET ERRORS",null,null,null,25,1]
[null,null,null,null,null,null,null,null,null,null,null,null,null,null,null,null,{"$f":"SUM(Q44:R46)","v":0},null,null,{"$f":"SUM(T44:U46)","v":0},{"$f":"IF(AND(Q43>0,T43>0),1,0)","v":0},null,null,20,0.98]
[null,null,null,null,null,null,null,null,null,null,null,null,null,null,null,null,{"$f":"IF(A41=\"EcoNet\",1,0)","v":0},{"$f":"IF(I41=\"EcoNet\",1,0)","v":0},null,{"$f":"IF(A41=\"Thermostatic Expansion Valve - Mounted\",1,IF(A41=\"Electronic Expansion Valve - Mounted\",1,IF(A41=\"Liquid Line Solenoid Valve - Mounted\",1,IF(A41=\"Mechanical Thermostat - Mounted\",1,IF(A41=\"Electronic Room Thermostat - Mounted\",1,0)))))","v":0},{"$f":"IF(I41=\"Thermostatic Expansion Valve - Mounted\",1,IF(I41=\"Electronic Expansion Valve - Mounted\",1,IF(I41=\"Liquid Line Solenoid Valve - Mounted\",1,IF(I41=\"Mechanical Thermostat - Mounted\",1,IF(I41=\"Electronic Room Thermostat - Mounted\",1,0)))))","v":0},null,null,10,0.94]
["Additional Requirements",null,null,null,null,null,null,null,null,null,null,null,null,null,null,null,{"$f":"IF(A42=\"EcoNet\",1,0)","v":0},{"$f":"IF(C42=\"EcoNet\",1,0)","v":0},null,{"$f":"IF(A42=\"Thermostatic Expansion Valve - Mounted\",1,IF(A42=\"Electronic Expansion Valve - Mounted\",1,IF(A42=\"Liquid Line Solenoid Valve - Mounted\",1,IF(A42=\"Mechanical Thermostat - Mounted\",1,IF(A42=\"Electronic Room Thermostat - Mounted\",1,0)))))","v":0},{"$f":"IF(I42=\"Thermostatic Expansion Valve - Mounted\",1,IF(I42=\"Electronic Expansion Valve - Mounted\",1,IF(I42=\"Liquid Line Solenoid Valve - Mounted\",1,IF(I42=\"Mechanical Thermostat - Mounted\",1,IF(I42=\"Electronic Room Thermostat - Mounted\",1,0)))))","v":0},null,null,0,1.075]
[null,null,null,null,null,null,null,null,null,null,null,null,null,null,null,null,{"$f":"IF(A43=\"EcoNet\",1,0)","v":0},{"$f":"IF(C43=\"EcoNet\",1,0)","v":0},null,{"$f":"IF(A43=\"Thermostatic Expansion Valve - Mounted\",1,IF(A43=\"Electronic Expansion Valve - Mounted\",1,IF(A43=\"Liquid Line Solenoid Valve - Mounted\",1,IF(A43=\"Mechanical Thermostat - Mounted\",1,IF(A43=\"Electronic Room Thermostat - Mounted\",1,0)))))","v":0},{"$f":"IF(I43=\"Thermostatic Expansion Valve - Mounted\",1,IF(I43=\"Electronic Expansion Valve - Mounted\",1,IF(I43=\"Liquid Line Solenoid Valve - Mounted\",1,IF(I43=\"Mechanical Thermostat - Mounted\",1,IF(I43=\"Electronic Room Thermostat - Mounted\",1,0)))))","v":0},null,null,"-10",1.0375000000000001]
[null,null,null,null,null,null,null,null,null,null,null,null,null,null,null,null,"TELLS CAP TABLE WHICH COLUMN TO LOOK ON",null,null,"TELLS CAP TABLE WHICH COLUMN TO LOOK ON",null,null,null,"-20",1]
[null,null,null,null,null,null,null,null,null,null,null,null,null,null,null,null,{"$f":"4&W9&\"404A\"","v":"4Hot Gas - 3 Pipe404A"},5,null,{"$f":"4&W9&\"404A\"","v":"4Hot Gas - 3 Pipe404A"},5,null,null,"-30",0.96250000000000002]
["Capacity Correction for Electric & Hot Gas Defrost Evaporators",null,null,null,null,null,null,null,null,null,null,null,null,null,null,null,{"$f":"6&W9&\"404A\"","v":"6Hot Gas - 3 Pipe404A"},6,null,{"$f":"6&W9&\"404A\"","v":"6Hot Gas - 3 Pipe404A"},6,null,null,"-40",0.92500000000000004]
["S.S.T. (Dew)",null,"25°F","20°F","0°F","-10°F","-20°F","-30°F","-40°F",null,null,null,null,null,null,null,{"$f":"\"4Electric-LT\"&\"404A\"","v":"4Electric-LT404A"},2,null,{"$f":"\"4Electric-LT\"&\"404A\"","v":"4Electric-LT404A"},2]
["Multiply Capacity by:",null,1.16875,1.1499999999999999,1.075,1.0375000000000001,1,0.96250000000000002,0.92500000000000004,null,null,null,null,null,null,null,{"$f":"\"6Electric-LT\"&\"404A\"","v":"6Electric-LT404A"},3,null,{"$f":"\"6Electric-LT\"&\"404A\"","v":"6Electric-LT404A"},3]
[null,null,null,null,null,null,null,null,null,null,null,null,null,null,null,null,{"$f":"\"6Electric-MT\"&\"404A\"","v":"6Electric-MT404A"},16,null,{"$f":"\"6Electric-MT\"&\"404A\"","v":"6Electric-MT404A"},17,null,null,{"$f":"IF(F14=\"AIR\",X42,IF(F14=\"Electric-MT\",X42,\"\"))","v":""},25,null,"Suction Temp Range"]
[null,null,null,null,null,null,null,null,null,null,null,null,null,null,null,null,{"$f":"\"6Air\"&\"404A\"","v":"6Air404A"},4,null,{"$f":"\"6Air\"&L14&\"404A\"","v":"6Air404A"},4,null,null,{"$f":"IF(F14=\"Electric-MT\",X43,\"\")","v":""},20,null,"25-10 MT"]
[null,null,null,null,null,null,null,null,null,null,null,null,null,null,null,null,{"$f":"4&W10&\"404A\"","v":"4Hot Gas - Reverse Cycle404A"},7,null,{"$f":"4&W10&\"404A\"","v":"4Hot Gas - Reverse Cycle404A"},7,null,null,{"$f":"IF(F14=\"Electric-MT\",X44,\"\")","v":""},10,null,"0 - -40 LT"]
[null,null,null,null,null,null,null,null,null,null,null,null,null,null,null,null,{"$f":"6&W10&\"404A\"","v":"6Hot Gas - Reverse Cycle404A"},8,null,{"$f":"6&W10&\"404A\"","v":"6Hot Gas - Reverse Cycle404A"},8,null,null,{"$f":"IF(F14=\"Electric-LT\",X45,IF(F14=\"Hot Gas - 3 Pipe\",X45,IF(F14=\"Hot Gas - Reverse Cycle\",X45,\"\")))","v":""},0]
[null,null,null,null,null,null,null,null,null,null,null,null,null,null,null,null,{"$f":"4&W9&\"774\"","v":"4Hot Gas - 3 Pipe774"},5,null,null,{"$f":"VLOOKUP(E14&F14&\"404A\",Q48:R62,2,FALSE)","v":{"$error":"#N/A"}},null,null,{"$f":"IF($F$14=\"Electric-LT\",X46,IF($F$14=\"Hot Gas - 3 Pipe\",X46,IF($F$14=\"Hot Gas - Reverse Cycle\",X46,\"\")))","v":""},"-10"]
[null,null,null,null,null,null,null,null,null,null,null,null,null,null,null,null,{"$f":"6&W9&\"774\"","v":"6Hot Gas - 3 Pipe774"},6,null,null,null,null,null,{"$f":"IF($F$14=\"Electric-LT\",X47,IF($F$14=\"Hot Gas - 3 Pipe\",X47,IF($F$14=\"Hot Gas - Reverse Cycle\",X47,\"\")))","v":""},"-20"]
[null,null,null,null,null,null,null,null,null,null,null,null,null,null,null,null,{"$f":"\"4Electric\"&\"774\"","v":"4Electric774"},2,null,null,null,null,null,{"$f":"IF($F$14=\"Electric-LT\",X48,IF($F$14=\"Hot Gas - 3 Pipe\",X48,IF($F$14=\"Hot Gas - Reverse Cycle\",X48,\"\")))","v":""},"-30"]
[null,null,null,null,null,null,null,null,null,null,null,null,null,null,null,null,{"$f":"\"6Electric\"&\"774\"","v":"6Electric774"},3,null,null,null,null,null,{"$f":"IF($F$14=\"Electric-LT\",X49,IF($F$14=\"Hot Gas - 3 Pipe\",X49,IF($F$14=\"Hot Gas - Reverse Cycle\",X49,\"\")))","v":""},"-40"]
[null,null,null,null,null,null,null,null,null,null,null,null,null,null,null,null,{"$f":"\"6Air\"&\"774\"","v":"6Air774"},4]
[null,null,null,null,null,null,null,null,null,null,null,null,null,null,null,null,{"$f":"4&W10&\"774\"","v":"4Hot Gas - Reverse Cycle774"},7]
[null,null,null,null,null,null,null,null,null,null,null,null,null,null,null,null,{"$f":"6&W10&\"774\"","v":"6Hot Gas - Reverse Cycle774"},8,null,"Electric-MT",{"$f":"IF($F$14=T62,1,0)","v":0}]
[null,null,null,null,null,null,null,null,null,null,null,null,null,null,null,null,{"$f":"4&W9&I14","v":"4Hot Gas - 3 Pipe"},12,null,"Electric-LT",{"$f":"IF($F$14=T63,1,0)","v":0}]
[null,null,null,null,null,null,null,null,null,null,null,null,null,null,null,null,{"$f":"6&W9&I14","v":"6Hot Gas - 3 Pipe"},13,null,"Hot Gas - 3 Pipe",{"$f":"IF($F$14=T64,1,0)","v":0}]
[null,null,null,null,null,null,null,null,null,null,null,null,null,null,null,null,{"$f":"\"4Electric-LT\"&I14","v":"4Electric-LT"},9,null,"Hot Gas - Reverse Cycle",0]
[null,null,null,null,null,null,null,null,null,null,null,null,null,null,null,null,{"$f":"\"6Electric-LT\"&I14","v":"6Electric-LT"},10,null,null,{"$f":"SUM(U62:U65)","v":0}]
[null,null,null,null,null,null,null,null,null,null,null,null,null,null,null,null,{"$f":"\"6Electric-MT\"&I14","v":"6Electric-MT"},17]
[null,null,null,null,null,null,null,null,null,null,null,null,null,null,null,null,{"$f":"\"6Air\"&I14","v":"6Air"},11]
[null,null,null,null,null,null,null,null,null,null,null,null,null,null,null,null,{"$f":"4&W10&I14","v":"4Hot Gas - Reverse Cycle"},14]
[null,null,null,null,null,null,null,null,null,null,null,null,null,null,null,null,{"$f":"6&W10&I14","v":"6Hot Gas - Reverse Cycle"},15]
[null,null,null,null,null,null,null,null,null,null,null,null,null,null,null,null,null,{"$f":"VLOOKUP(E14&F14&I14,Q48:R70,2,FALSE)","v":{"$error":"#N/A"}}]
[null,null,null,null,null,null,null,null,null,null,null,null,null,null,null,null,null,{"$f":"E14&F14&I14","v":""}]

{"sheet":"Sheet3","index":1,"n_rows":0,"n_cols":0,"rows_kept":0,"cut":false,"hidden":true,"merged":[]}

{"sheet":"Sheet2","index":2,"n_rows":0,"n_cols":0,"rows_kept":0,"cut":false,"hidden":true,"merged":[]}

{"sheet":"Sheet1","index":3,"n_rows":0,"n_cols":0,"rows_kept":0,"cut":false,"hidden":true,"merged":[]}

{"sheet":"REVISION","index":4,"n_rows":4,"n_cols":3,"rows_kept":4,"cut":false,"hidden":true,"merged":[]}
[]
["1.00","2020-07-22","initial release"]
[1.01,"2020-08-25","added notes section and fixed clear all macro"]
[1.05,"2024-02-02","Medium Temp Electric Defrost"]

{"sheet":"SUBMITTAL DATA","index":5,"n_rows":140,"n_cols":31,"rows_kept":140,"cut":false,"hidden":true,"merged":[]}
["GENERIC MODEL",null,"MODEL FAMILY","DEFROST TYPE","NUMBER OF FANS","MOTOR TYPE","UNIT VOLTAGE","FPI","SST","R404A CAPACITY","R407A/R448A/R449A CAPACITY",null,null,null,"CFM","MOTOR VOLTAGE","TOTAL UNIT FAN MOTOR AMPS","HEATER VOLTAGE","HEATER AMPS","HEATER WATTS","LIQUID LINE SIZE","SUCTION LINE SIZE","3-PIPE HG LINE","MCA - NO-ECONET","MOPD - NO-ECONET","MCA - ECONET","MOPD - ECONET","NET WEIGHT","APPROX. SHIP WEIGHT","AWEF CLR","AWEF FRZR"]
["M6A182ADA",null,"MEDIUM PROFILE","AIR DEFROST",1,"DUAL SPEED EC MOTOR","115/1/60",6,25,18200,21100,"-","-","-",3190,"115/1/60",3.2,"-","-","-","3/8","7/8","-",15,20,15,20,120,330,9,"N/A"]
["M6A220ADA",null,"MEDIUM PROFILE","AIR DEFROST",1,"DUAL SPEED EC MOTOR","115/1/60",6,25,22000,25800,"-","-","-",2950,"115/1/60",3.2,"-","-","-","3/8","7/8","-",15,20,15,20,120,330,9,"N/A"]
["M6A276ADA",null,"MEDIUM PROFILE","AIR DEFROST",2,"DUAL SPEED EC MOTOR","115/1/60",6,25,27600,32300,"-","-","-",6950,"115/1/60",6.4,"-","-","-","1/2","1-1/8","-",15,20,15,20,220,505,9,"N/A"]
["M6A370ADA",null,"MEDIUM PROFILE","AIR DEFROST",2,"DUAL SPEED EC MOTOR","115/1/60",6,25,37000,43100,"-","-","-",6380,"115/1/60",6.4,"-","-","-","1/2","1-1/8","-",15,20,15,20,220,505,9,"N/A"]
["M6A442ADA",null,"MEDIUM PROFILE","AIR DEFROST",2,"DUAL SPEED EC MOTOR","115/1/60",6,25,44200,51900,"-","-","-",5900,"115/1/60",6.4,"-","-","-","5/8","1-1/8","-",15,20,15,20,220,505,9,"N/A"]
["M6A549ADA",null,"MEDIUM PROFILE","AIR DEFROST",3,"DUAL SPEED EC MOTOR","115/1/60",6,25,54900,64200,"-","-","-",9580,"115/1/60",9.6,"-","-","-","5/8",1.375,"-",15,20,15,20,316,691,9,"N/A"]
["M6A658ADA",null,"MEDIUM PROFILE","AIR DEFROST",3,"DUAL SPEED EC MOTOR","115/1/60",6,25,65800,76900,"-","-","-",8860,"115/1/60",9.6,"-","-","-","5/8",1.375,"-",15,20,15,20,316,691,9,"N/A"]
["M6A182DDA",null,"MEDIUM PROFILE","AIR DEFROST",1,"DUAL SPEED EC MOTOR","208-230/1/60",6,25,18200,21100,"-","-","-",3190,"208-230/1/60",1.9,"-","-","-","3/8","7/8","-",15,20,15,20,120,330,9,"N/A"]
["M6A220DDA",null,"MEDIUM PROFILE","AIR DEFROST",1,"DUAL SPEED EC MOTOR","208-230/1/60",6,25,22000,25800,"-","-","-",2950,"208-230/1/60",1.9,"-","-","-","3/8","7/8","-",15,20,15,20,120,330,9,"N/A"]
["M6A276DDA",null,"MEDIUM PROFILE","AIR DEFROST",2,"DUAL SPEED EC MOTOR","208-230/1/60",6,25,27600,32300,"-","-","-",6950,"208-230/1/60",3.8,"-","-","-","1/2","1-1/8","-",15,20,15,20,220,505,9,"N/A"]
["M6A370DDA",null,"MEDIUM PROFILE","AIR DEFROST",2,"DUAL SPEED EC MOTOR","208-230/1/60",6,25,37000,43100,"-","-","-",6380,"208-230/1/60",3.8,"-","-","-","1/2","1-1/8","-",15,20,15,20,220,505,9,"N/A"]
["M6A442DDA",null,"MEDIUM PROFILE","AIR DEFROST",2,"DUAL SPEED EC MOTOR","208-230/1/60",6,25,44200,51900,"-","-","-",5900,"208-230/1/60",3.8,"-","-","-","5/8","1-1/8","-",15,20,15,20,220,505,9,"N/A"]
["M6A549DDA",null,"MEDIUM PROFILE","AIR DEFROST",3,"DUAL SPEED EC MOTOR","208-230/1/60",6,25,54900,64200,"-","-","-",9580,"208-230/1/60",5.7,"-","-","-","5/8",1.375,"-",15,20,15,20,316,691,9,"N/A"]
["M6A658DDA",null,"MEDIUM PROFILE","AIR DEFROST",3,"DUAL SPEED EC MOTOR","208-230/1/60",6,25,65800,76900,"-","-","-",8860,"208-230/1/60",5.7,"-","-","-","5/8",1.375,"-",15,20,15,20,316,691,9,"N/A"]
["M6A182FDA",null,"MEDIUM PROFILE","AIR DEFROST",1,"DUAL SPEED EC MOTOR","460/1/60",6,25,18200,21100,"-","-","-",3190,"460/1/60",1.2,"-","-","-","3/8","7/8","-",15,20,15,20,120,330,9,"N/A"]
["M6A220FDA",null,"MEDIUM PROFILE","AIR DEFROST",1,"DUAL SPEED EC MOTOR","460/1/60",6,25,22000,25800,"-","-","-",2950,"460/1/60",1.2,"-","-","-","3/8","7/8","-",15,20,15,20,120,330,9,"N/A"]
["M6A276FDA",null,"MEDIUM PROFILE","AIR DEFROST",2,"DUAL SPEED EC MOTOR","460/1/60",6,25,27600,32300,"-","-","-",6950,"460/1/60",2.4,"-","-","-","1/2","1-1/8","-",15,20,15,20,220,505,9,"N/A"]
["M6A370FDA",null,"MEDIUM PROFILE","AIR DEFROST",2,"DUAL SPEED EC MOTOR","460/1/60",6,25,37000,43100,"-","-","-",6380,"460/1/60",2.4,"-","-","-","1/2","1-1/8","-",15,20,15,20,220,505,9,"N/A"]
["M6A442FDA",null,"MEDIUM PROFILE","AIR DEFROST",2,"DUAL SPEED EC MOTOR","460/1/60",6,25,44200,51900,"-","-","-",5900,"460/1/60",2.4,"-","-","-","5/8","1-1/8","-",15,20,15,20,220,505,9,"N/A"]
["M6A549FDA",null,"MEDIUM PROFILE","AIR DEFROST",3,"DUAL SPEED EC MOTOR","460/1/60",6,25,54900,64200,"-","-","-",9580,"460/1/60",3.6,"-","-","-","5/8",1.375,"-",15,20,15,20,316,691,9,"N/A"]
["M6A658FDA",null,"MEDIUM PROFILE","AIR DEFROST",3,"DUAL SPEED EC MOTOR","460/1/60",6,25,65800,76900,"-","-","-",8860,"460/1/60",3.6,"-","-","-","5/8",1.375,"-",15,20,15,20,316,691,9,"N/A"]
["M6E153DDA",null,"MEDIUM PROFILE","ELECTRIC DEFROST",1,"DUAL SPEED EC MOTOR","208-230/1/60",6,-20,15300,17400,null,null,null,2250,"208-230/1/60",1.9,"208-230/1/60",19.5,4480,"3/8",1.125,"-",15,20,20.5,25,120,330,9,4.1500000000000004]
["M6E184DDA",null,"MEDIUM PROFILE","ELECTRIC DEFROST",1,"DUAL SPEED EC MOTOR","208-230/1/60",6,-20,18400,21100,null,null,null,2090,"208-230/1/60",1.9,"208-230/1/60",19.5,4480,"3/8",1.125,"-",15,20,20.5,25,120,330,9,4.1500000000000004]
["M6E311DDA",null,"MEDIUM PROFILE","ELECTRIC DEFROST",2,"DUAL SPEED EC MOTOR","208-230/1/60",6,-20,31100,35700,null,null,null,4500,"208-230/1/60",3.8,"208-230/1/60",38.5,8860,"1/2",1.625,"-",15,20,40.5,45,220,505,9,4.1500000000000004]
["M6E374DDA",null,"MEDIUM PROFILE","ELECTRIC DEFROST",2,"DUAL SPEED EC MOTOR","208-230/1/60",6,-20,37400,42900,null,null,null,4180,"208-230/1/60",3.8,"208-230/1/60",38.5,8860,0.625,1.625,"-",15,20,40.5,45,220,505,9,4.1500000000000004]
["M4E110DDA",null,"MEDIUM PROFILE","ELECTRIC DEFROST",1,"DUAL SPEED EC MOTOR","208-230/1/60",4,-20,11000,12400,null,null,null,2350,"208-230/1/60",1.9,"208-230/1/60",19.5,4480,"3/8",1.125,"-",15,20,20.5,25,120,330,"N/A",4.1500000000000004]
["M4E143DDA",null,"MEDIUM PROFILE","ELECTRIC DEFROST",1,"DUAL SPEED EC MOTOR","208-230/1/60",4,-20,14300,16200,null,null,null,2210,"208-230/1/60",1.9,"208-230/1/60",19.5,4480,"3/8",1.125,"-",15,20,20.5,25,120,330,"N/A",4.1500000000000004]
["M4E232DDA",null,"MEDIUM PROFILE","ELECTRIC DEFROST",2,"DUAL SPEED EC MOTOR","208-230/1/60",4,-20,23200,26100,null,null,null,4690,"208-230/1/60",3.8,"208-230/1/60",38.5,8860,"1/2",1.375,"-",15,20,40.5,45,220,505,"N/A",4.1500000000000004]
["M4E288DDA",null,"MEDIUM PROFILE","ELECTRIC DEFROST",2,"DUAL SPEED EC MOTOR","208-230/1/60",4,-20,28800,32700,null,null,null,4420,"208-230/1/60",3.8,"208-230/1/60",38.5,8860,"1/2",1.375,"-",15,20,40.5,45,220,505,"N/A",4.1500000000000004]
["M6E153EDA",null,"MEDIUM PROFILE","ELECTRIC DEFROST",1,"DUAL SPEED EC MOTOR","208-230/3/60",6,-20,15300,17400,null,null,null,2250,"208-230/1/60",1.9,"208-230/3/60",11.2,4480,"3/8",1.125,"-",15,20,15,25,120,330,9,4.1500000000000004]
["M6E184EDA",null,"MEDIUM PROFILE","ELECTRIC DEFROST",1,"DUAL SPEED EC MOTOR","208-230/3/60",6,-20,18400,21100,null,null,null,2090,"208-230/1/60",1.9,"208-230/3/60",11.2,4480,"3/8",1.125,"-",15,20,15,25,120,330,9,4.1500000000000004]
["M6E311EDA",null,"MEDIUM PROFILE","ELECTRIC DEFROST",2,"DUAL SPEED EC MOTOR","208-230/3/60",6,-20,31100,35700,null,null,null,4500,"208-230/1/60",3.8,"208-230/3/60",22.2,8860,"1/2",1.625,"-",15,20,23.2,25,220,505,9,4.1500000000000004]
["M6E374EDA",null,"MEDIUM PROFILE","ELECTRIC DEFROST",2,"DUAL SPEED EC MOTOR","208-230/3/60",6,-20,37400,42900,null,null,null,4180,"208-230/1/60",3.8,"208-230/3/60",22.2,8860,0.625,1.625,"-",15,20,23.2,25,220,505,9,4.1500000000000004]
["M6E469EDA",null,"MEDIUM PROFILE","ELECTRIC DEFROST",3,"DUAL SPEED EC MOTOR","208-230/3/60",6,-20,46900,53600,null,null,null,6750,"208-230/1/60",5.7,"208-230/3/60",33.5,13340,"5/8",2.125,"-",15,20,35.5,40,320,691,9,4.1500000000000004]
["M6E564EDA",null,"MEDIUM PROFILE","ELECTRIC DEFROST",3,"DUAL SPEED EC MOTOR","208-230/3/60",6,-20,56400,64300,null,null,null,6270,"208-230/1/60",5.7,"208-230/3/60",33.5,13340,"5/8",2.125,"-",15,20,35.5,40,320,691,9,4.1500000000000004]
["M4E110EDA",null,"MEDIUM PROFILE","ELECTRIC DEFROST",1,"DUAL SPEED EC MOTOR","208-230/3/60",4,-20,11000,12400,null,null,null,2350,"208-230/1/60",1.9,"208-230/3/60",11.2,4480,"3/8",1.125,"-",15,20,15,25,120,330,"N/A",4.1500000000000004]
["M4E143EDA",null,"MEDIUM PROFILE","ELECTRIC DEFROST",1,"DUAL SPEED EC MOTOR","208-230/3/60",4,-20,14300,16200,null,null,null,2210,"208-230/1/60",1.9,"208-230/3/60",11.2,4480,"3/8",1.125,"-",15,20,15,25,120,330,"N/A",4.1500000000000004]
["M4E232EDA",null,"MEDIUM PROFILE","ELECTRIC DEFROST",2,"DUAL SPEED EC MOTOR","208-230/3/60",4,-20,23200,26100,null,null,null,4690,"208-230/1/60",3.8,"208-230/3/60",22.2,8860,0.5,1.375,"-",15,20,23.2,25,220,505,"N/A",4.1500000000000004]
["M4E288EDA",null,"MEDIUM PROFILE","ELECTRIC DEFROST",2,"DUAL SPEED EC MOTOR","208-230/3/60",4,-20,28800,32700,null,null,null,4420,"208-230/1/60",3.8,"208-230/3/60",22.2,8860,0.5,1.375,"-",15,20,23.2,25,220,505,"N/A",4.1500000000000004]
["M4E336EDA",null,"MEDIUM PROFILE","ELECTRIC DEFROST",3,"DUAL SPEED EC MOTOR","208-230/3/60",4,-20,33600,38300,null,null,null,7040,"208-230/1/60",5.7,"208-230/3/60",33.5,13340,0.5,1.625,"-",15,20,35.5,40,320,691,"N/A",4.1500000000000004]
["M4E419EDA",null,"MEDIUM PROFILE","ELECTRIC DEFROST",3,"DUAL SPEED EC MOTOR","208-230/3/60",4,-20,41900,47600,null,null,null,6640,"208-230/1/60",5.7,"208-230/3/60",33.5,13340,0.625,1.625,"-",15,20,35.5,40,320,691,"N/A",4.1500000000000004]
["M6E153FDA",null,"MEDIUM PROFILE","ELECTRIC DEFROST",1,"DUAL SPEED EC MOTOR","460/1/60",6,-20,15300,17400,null,null,null,2250,"460/1/60",1.2,"460/1/60",9.6999999999999993,4480,"3/8",1.125,"-",15,20,15,25,120,330,9,4.1500000000000004]
["M6E184FDA",null,"MEDIUM PROFILE","ELECTRIC DEFROST",1,"DUAL SPEED EC MOTOR","460/1/60",6,-20,18400,21100,null,null,null,2090,"460/1/60",1.2,"460/1/60",9.6999999999999993,4480,"3/8",1.125,"-",15,20,15,25,120,330,9,4.1500000000000004]
["M6E311FDA",null,"MEDIUM PROFILE","ELECTRIC DEFROST",2,"DUAL SPEED EC MOTOR","460/1/60",6,-20,31100,35700,null,null,null,4500,"460/1/60",2.4,"460/1/60",19.3,8860,"1/2",1.625,"-",15,20,20.3,25,220,505,9,4.1500000000000004]
["M6E374FDA",null,"MEDIUM PROFILE","ELECTRIC DEFROST",2,"DUAL SPEED EC MOTOR","460/1/60",6,-20,37400,42900,null,null,null,4180,"460/1/60",2.4,"460/1/60",19.3,8860,0.625,1.625,"-",15,20,20.3,25,220,505,9,4.1500000000000004]
["M6E469FDA",null,"MEDIUM PROFILE","ELECTRIC DEFROST",3,"DUAL SPEED EC MOTOR","460/1/60",6,-20,46900,53600,null,null,null,6750,"460/1/60",3.6,"460/1/60",29,13340,"5/8",2.125,"-",15,20,30,35,320,691,9,4.1500000000000004]
["M6E564FDA",null,"MEDIUM PROFILE","ELECTRIC DEFROST",3,"DUAL SPEED EC MOTOR","460/1/60",6,-20,56400,64300,null,null,null,6270,"460/1/60",3.6,"460/1/60",29,13340,"5/8",2.125,"-",15,20,30,35,320,691,9,4.1500000000000004]
["M4E110FDA",null,"MEDIUM PROFILE","ELECTRIC DEFROST",1,"DUAL SPEED EC MOTOR","460/1/60",4,-20,11000,12400,null,null,null,2350,"460/1/60",1.2,"460/1/60",9.6999999999999993,4480,"3/8",1.125,"-",15,20,15,25,120,330,"N/A",4.1500000000000004]
["M4E143FDA",null,"MEDIUM PROFILE","ELECTRIC DEFROST",1,"DUAL SPEED EC MOTOR","460/1/60",4,-20,14300,16200,null,null,null,2210,"460/1/60",1.2,"460/1/60",9.6999999999999993,4480,"3/8",1.125,"-",15,20,15,25,120,330,"N/A",4.1500000000000004]
["M4E232FDA",null,"MEDIUM PROFILE","ELECTRIC DEFROST",2,"DUAL SPEED EC MOTOR","460/1/60",4,-20,23200,26100,null,null,null,4690,"460/1/60",2.4,"460/1/60",19.3,8860,0.5,1.375,"-",15,20,20.3,25,220,505,"N/A",4.1500000000000004]
["M4E288FDA",null,"MEDIUM PROFILE","ELECTRIC DEFROST",2,"DUAL SPEED EC MOTOR","460/1/60",4,-20,28800,32700,null,null,null,4420,"460/1/60",2.4,"460/1/60",19.3,8860,0.5,1.375,"-",15,20,20.3,25,220,505,"N/A",4.1500000000000004]
["M4E336FDA",null,"MEDIUM PROFILE","ELECTRIC DEFROST",3,"DUAL SPEED EC MOTOR","460/1/60",4,-20,33600,38300,null,null,null,7040,"460/1/60",3.6,"460/1/60",29,13340,0.5,1.625,"-",15,20,30,35,320,691,"N/A",4.1500000000000004]
["M4E419FDA",null,"MEDIUM PROFILE","ELECTRIC DEFROST",3,"DUAL SPEED EC MOTOR","460/1/60",4,-20,41900,47600,null,null,null,6640,"460/1/60",3.6,"460/1/60",29,13340,0.625,1.625,"-",15,20,30,35,320,691,"N/A",4.1500000000000004]
["M6E153GDA",null,"MEDIUM PROFILE","ELECTRIC DEFROST",1,"DUAL SPEED EC MOTOR","460/3/60",6,-20,15300,17400,null,null,null,2250,"460/1/60",1.2,"460/3/60",5.6,4480,"3/8",1.125,"-",15,20,15,20,120,330,9,4.1500000000000004]
["M6E184GDA",null,"MEDIUM PROFILE","ELECTRIC DEFROST",1,"DUAL SPEED EC MOTOR","460/3/60",6,-20,18400,21100,null,null,null,2090,"460/1/60",1.2,"460/3/60",5.6,4480,"3/8",1.125,"-",15,20,15,20,120,330,9,4.1500000000000004]
["M6E311GDA",null,"MEDIUM PROFILE","ELECTRIC DEFROST",2,"DUAL SPEED EC MOTOR","460/3/60",6,-20,31100,35700,null,null,null,4500,"460/1/60",2.4,"460/3/60",11.1,8860,"1/2",1.625,"-",15,20,15,20,220,505,9,4.1500000000000004]
["M6E374GDA",null,"MEDIUM PROFILE","ELECTRIC DEFROST",2,"DUAL SPEED EC MOTOR","460/3/60",6,-20,37400,42900,null,null,null,4180,"460/1/60",2.4,"460/3/60",11.1,8860,0.625,1.625,"-",15,20,15,20,220,505,9,4.1500000000000004]
["M6E469GDA",null,"MEDIUM PROFILE","ELECTRIC DEFROST",3,"DUAL SPEED EC MOTOR","460/3/60",6,-20,46900,53600,null,null,null,6750,"460/1/60",3.6,"460/3/60",16.7,13340,"5/8",2.125,"-",15,20,17.7,20,320,691,9,4.1500000000000004]
["M6E564GDA",null,"MEDIUM PROFILE","ELECTRIC DEFROST",3,"DUAL SPEED EC MOTOR","460/3/60",6,-20,56400,64300,null,null,null,6270,"460/1/60",3.6,"460/3/60",16.7,13340,"5/8",2.125,"-",15,20,17.7,20,320,691,9,4.1500000000000004]
["M4E110GDA",null,"MEDIUM PROFILE","ELECTRIC DEFROST",1,"DUAL SPEED EC MOTOR","460/3/60",4,-20,11000,12400,null,null,null,2350,"460/1/60",1.2,"460/3/60",5.6,4480,"3/8",1.125,"-",15,20,15,20,120,330,"N/A",4.1500000000000004]
["M4E143GDA",null,"MEDIUM PROFILE","ELECTRIC DEFROST",1,"DUAL SPEED EC MOTOR","460/3/60",4,-20,14300,16200,null,null,null,2210,"460/1/60",1.2,"460/3/60",5.6,4480,"3/8",1.125,"-",15,20,15,20,120,330,"N/A",4.1500000000000004]
["M4E232GDA",null,"MEDIUM PROFILE","ELECTRIC DEFROST",2,"DUAL SPEED EC MOTOR","460/3/60",4,-20,23200,26100,null,null,null,4690,"460/1/60",2.4,"460/3/60",11.1,8860,0.5,1.375,"-",15,20,15,20,220,505,"N/A",4.1500000000000004]
["M4E288GDA",null,"MEDIUM PROFILE","ELECTRIC DEFROST",2,"DUAL SPEED EC MOTOR","460/3/60",4,-20,28800,32700,null,null,null,4420,"460/1/60",2.4,"460/3/60",11.1,8860,0.5,1.375,"-",15,20,15,20,220,505,"N/A",4.1500000000000004]
["M4E336GDA",null,"MEDIUM PROFILE","ELECTRIC DEFROST",3,"DUAL SPEED EC MOTOR","460/3/60",4,-20,33600,38300,null,null,null,7040,"460/1/60",3.6,"460/3/60",16.7,13340,0.5,1.625,"-",15,20,17.7,20,320,691,"N/A",4.1500000000000004]
["M4E419GDA",null,"MEDIUM PROFILE","ELECTRIC DEFROST",3,"DUAL SPEED EC MOTOR","460/3/60",4,-20,41900,47600,null,null,null,6640,"460/1/60",3.6,"460/3/60",16.7,13340,0.625,1.625,"-",15,20,17.7,20,320,691,"N/A",4.1500000000000004]
["M6H153DDA",null,"MEDIUM PROFILE","HOT GAS - 3-PIPE",1,"DUAL SPEED EC MOTOR","208-230/1/60",6,-20,15300,17400,null,null,null,2250,"208-230/1/60",1.9,"208-230/1/60",6.4,1480,"3/8",1.125,0.5,15,20,"-","-",120,330,9,4.1500000000000004]
["M6H184DDA",null,"MEDIUM PROFILE","HOT GAS - 3-PIPE",1,"DUAL SPEED EC MOTOR","208-230/1/60",6,-20,18400,21100,null,null,null,2090,"208-230/1/60",1.9,"208-230/1/60",6.4,1480,"3/8",1.125,0.5,15,20,"-","-",120,330,9,4.1500000000000004]
["M6H311DDA",null,"MEDIUM PROFILE","HOT GAS - 3-PIPE",2,"DUAL SPEED EC MOTOR","208-230/1/60",6,-20,31100,35700,null,null,null,4500,"208-230/1/60",3.8,"208-230/1/60",12.9,2960,"1/2",1.625,0.625,15,20,"-","-",220,505,9,4.1500000000000004]
["M6H374DDA",null,"MEDIUM PROFILE","HOT GAS - 3-PIPE",2,"DUAL SPEED EC MOTOR","208-230/1/60",6,-20,37400,42900,null,null,null,4180,"208-230/1/60",3.8,"208-230/1/60",12.9,2960,0.625,1.625,0.875,15,20,"-","-",220,505,9,4.1500000000000004]
["M6H469DDA",null,"MEDIUM PROFILE","HOT GAS - 3-PIPE",3,"DUAL SPEED EC MOTOR","208-230/1/60",6,-20,46900,53600,null,null,null,6750,"208-230/1/60",5.7,"208-230/1/60",19.3,4400,"5/8",2.125,0.875,15,20,"-","-",320,691,9,4.1500000000000004]
["M6H564DDA",null,"MEDIUM PROFILE","HOT GAS - 3-PIPE",3,"DUAL SPEED EC MOTOR","208-230/1/60",6,-20,56400,64300,null,null,null,6270,"208-230/1/60",5.7,"208-230/1/60",19.3,4400,"5/8",2.125,0.875,15,20,"-","-",320,691,9,4.1500000000000004]
["M4H110DDA",null,"MEDIUM PROFILE","HOT GAS - 3-PIPE",1,"DUAL SPEED EC MOTOR","208-230/1/60",4,-20,11000,12400,null,null,null,2350,"208-230/1/60",1.9,"208-230/1/60",6.4,1480,"3/8",1.125,0.5,15,20,"-","-",120,330,"N/A",4.1500000000000004]
["M4H143DDA",null,"MEDIUM PROFILE","HOT GAS - 3-PIPE",1,"DUAL SPEED EC MOTOR","208-230/1/60",4,-20,14300,16200,null,null,null,2210,"208-230/1/60",1.9,"208-230/1/60",6.4,1480,"3/8",1.125,0.5,15,20,"-","-",120,330,"N/A",4.1500000000000004]
["M4H232DDA",null,"MEDIUM PROFILE","HOT GAS - 3-PIPE",2,"DUAL SPEED EC MOTOR","208-230/1/60",4,-20,23200,26100,null,null,null,4690,"208-230/1/60",3.8,"208-230/1/60",12.9,2960,0.5,1.375,0.625,15,20,"-","-",220,505,"N/A",4.1500000000000004]
["M4H288DDA",null,"MEDIUM PROFILE","HOT GAS - 3-PIPE",2,"DUAL SPEED EC MOTOR","208-230/1/60",4,-20,28800,32700,null,null,null,4420,"208-230/1/60",3.8,"208-230/1/60",12.9,2960,0.5,1.375,0.625,15,20,"-","-",220,505,"N/A",4.1500000000000004]
["M4H336DDA",null,"MEDIUM PROFILE","HOT GAS - 3-PIPE",3,"DUAL SPEED EC MOTOR","208-230/1/60",4,-20,33600,38300,null,null,null,7040,"208-230/1/60",5.7,"208-230/1/60",19.3,4400,0.5,1.625,0.625,15,20,"-","-",320,691,"N/A",4.1500000000000004]
["M4H419DDA",null,"MEDIUM PROFILE","HOT GAS - 3-PIPE",3,"DUAL SPEED EC MOTOR","208-230/1/60",4,-20,41900,47600,null,null,null,6640,"208-230/1/60",5.7,"208-230/1/60",19.3,4400,0.625,1.625,0.875,15,20,"-","-",320,691,"N/A",4.1500000000000004]
["M6H153FDA",null,"MEDIUM PROFILE","HOT GAS - 3-PIPE",1,"DUAL SPEED EC MOTOR","460/1/60",6,-20,15300,17400,null,null,null,2250,"460/1/60",1.2,"460/1/60",3.2,1480,"3/8",1.125,0.5,15,20,"-","-",120,330,9,4.1500000000000004]
["M6H184FDA",null,"MEDIUM PROFILE","HOT GAS - 3-PIPE",1,"DUAL SPEED EC MOTOR","460/1/60",6,-20,18400,21100,null,null,null,2090,"460/1/60",1.2,"460/1/60",3.2,1480,"3/8",1.125,0.5,15,20,"-","-",120,330,9,4.1500000000000004]
["M6H311FDA",null,"MEDIUM PROFILE","HOT GAS - 3-PIPE",2,"DUAL SPEED EC MOTOR","460/1/60",6,-20,31100,35700,null,null,null,4500,"460/1/60",2.4,"460/1/60",6.4,2960,"1/2",1.625,0.625,15,20,"-","-",220,505,9,4.1500000000000004]
["M6H374FDA",null,"MEDIUM PROFILE","HOT GAS - 3-PIPE",2,"DUAL SPEED EC MOTOR","460/1/60",6,-20,37400,42900,null,null,null,4180,"460/1/60",2.4,"460/1/60",6.4,2960,0.625,1.625,0.875,15,20,"-","-",220,505,9,4.1500000000000004]
["M6H469FDA",null,"MEDIUM PROFILE","HOT GAS - 3-PIPE",3,"DUAL SPEED EC MOTOR","460/1/60",6,-20,46900,53600,null,null,null,6750,"460/1/60",3.6,"460/1/60",9.6999999999999993,4400,"5/8",2.125,0.875,15,20,"-","-",320,691,9,4.1500000000000004]
["M6H564FDA",null,"MEDIUM PROFILE","HOT GAS - 3-PIPE",3,"DUAL SPEED EC MOTOR","460/1/60",6,-20,56400,64300,null,null,null,6270,"460/1/60",3.6,"460/1/60",9.6999999999999993,4400,"5/8",2.125,0.875,15,20,"-","-",320,691,9,4.1500000000000004]
["M4H110FDA",null,"MEDIUM PROFILE","HOT GAS - 3-PIPE",1,"DUAL SPEED EC MOTOR","460/1/60",4,-20,11000,12400,null,null,null,2350,"460/1/60",1.2,"460/1/60",3.2,1480,"3/8",1.125,0.5,15,20,"-","-",120,330,"N/A",4.1500000000000004]
["M4H143FDA",null,"MEDIUM PROFILE","HOT GAS - 3-PIPE",1,"DUAL SPEED EC MOTOR","460/1/60",4,-20,14300,16200,null,null,null,2210,"460/1/60",1.2,"460/1/60",3.2,1480,"3/8",1.125,0.5,15,20,"-","-",120,330,"N/A",4.1500000000000004]
["M4H232FDA",null,"MEDIUM PROFILE","HOT GAS - 3-PIPE",2,"DUAL SPEED EC MOTOR","460/1/60",4,-20,23200,26100,null,null,null,4690,"460/1/60",2.4,"460/1/60",6.4,2960,0.5,1.375,0.625,15,20,"-","-",220,505,"N/A",4.1500000000000004]
["M4H288FDA",null,"MEDIUM PROFILE","HOT GAS - 3-PIPE",2,"DUAL SPEED EC MOTOR","460/1/60",4,-20,28800,32700,null,null,null,4420,"460/1/60",2.4,"460/1/60",6.4,2960,0.5,1.375,0.625,15,20,"-","-",220,505,"N/A",4.1500000000000004]
["M4H336FDA",null,"MEDIUM PROFILE","HOT GAS - 3-PIPE",3,"DUAL SPEED EC MOTOR","460/1/60",4,-20,33600,38300,null,null,null,7040,"460/1/60",3.6,"460/1/60",9.6999999999999993,4400,0.5,1.625,0.625,15,20,"-","-",320,691,"N/A",4.1500000000000004]
["M4H419FDA",null,"MEDIUM PROFILE","HOT GAS - 3-PIPE",3,"DUAL SPEED EC MOTOR","460/1/60",4,-20,41900,47600,null,null,null,6640,"460/1/60",3.6,"460/1/60",9.6999999999999993,4400,0.625,1.625,0.875,15,20,"-","-",320,691,"N/A",4.1500000000000004]
["M6G153DDA",null,"MEDIUM PROFILE","HOT GAS - REVERSE CYCLE",1,"DUAL SPEED EC MOTOR","208-230/1/60",6,-20,15300,17400,null,null,null,2250,"208-230/1/60",1.9,"208-230/1/60",6.4,1480,"3/8",1.125,"-",15,20,"-","-",120,330,9,4.1500000000000004]
["M6G184DDA",null,"MEDIUM PROFILE","HOT GAS - REVERSE CYCLE",1,"DUAL SPEED EC MOTOR","208-230/1/60",6,-20,18400,21100,null,null,null,2090,"208-230/1/60",1.9,"208-230/1/60",6.4,1480,"3/8",1.125,"-",15,20,"-","-",120,330,9,4.1500000000000004]
["M6G311DDA",null,"MEDIUM PROFILE","HOT GAS - REVERSE CYCLE",2,"DUAL SPEED EC MOTOR","208-230/1/60",6,-20,31100,35700,null,null,null,4500,"208-230/1/60",3.8,"208-230/1/60",12.9,2960,"1/2",1.625,"-",15,20,"-","-",220,505,9,4.1500000000000004]
["M6G374DDA",null,"MEDIUM PROFILE","HOT GAS - REVERSE CYCLE",2,"DUAL SPEED EC MOTOR","208-230/1/60",6,-20,37400,42900,null,null,null,4180,"208-230/1/60",3.8,"208-230/1/60",12.9,2960,0.625,1.625,"-",15,20,"-","-",220,505,9,4.1500000000000004]
["M6G469DDA",null,"MEDIUM PROFILE","HOT GAS - REVERSE CYCLE",3,"DUAL SPEED EC MOTOR","208-230/1/60",6,-20,46900,53600,null,null,null,6750,"208-230/1/60",5.7,"208-230/1/60",19.3,4400,"5/8",2.125,"-",15,20,"-","-",320,691,9,4.1500000000000004]
["M6G564DDA",null,"MEDIUM PROFILE","HOT GAS - REVERSE CYCLE",3,"DUAL SPEED EC MOTOR","208-230/1/60",6,-20,56400,64300,null,null,null,6270,"208-230/1/60",5.7,"208-230/1/60",19.3,4400,"5/8",2.125,"-",15,20,"-","-",320,691,9,4.1500000000000004]
["M4G110DDA",null,"MEDIUM PROFILE","HOT GAS - REVERSE CYCLE",1,"DUAL SPEED EC MOTOR","208-230/1/60",4,-20,11000,12400,null,null,null,2350,"208-230/1/60",1.9,"208-230/1/60",6.4,1480,"3/8",1.125,"-",15,20,"-","-",120,330,"N/A",4.1500000000000004]
["M4G143DDA",null,"MEDIUM PROFILE","HOT GAS - REVERSE CYCLE",1,"DUAL SPEED EC MOTOR","208-230/1/60",4,-20,14300,16200,null,null,null,2210,"208-230/1/60",1.9,"208-230/1/60",6.4,1480,"3/8",1.125,"-",15,20,"-","-",120,330,"N/A",4.1500000000000004]
["M4G232DDA",null,"MEDIUM PROFILE","HOT GAS - REVERSE CYCLE",2,"DUAL SPEED EC MOTOR","208-230/1/60",4,-20,23200,26100,null,null,null,4690,"208-230/1/60",3.8,"208-230/1/60",12.9,2960,0.5,1.375,"-",15,20,"-","-",220,505,"N/A",4.1500000000000004]
["M4G288DDA",null,"MEDIUM PROFILE","HOT GAS - REVERSE CYCLE",2,"DUAL SPEED EC MOTOR","208-230/1/60",4,-20,28800,32700,null,null,null,4420,"208-230/1/60",3.8,"208-230/1/60",12.9,2960,0.5,1.375,"-",15,20,"-","-",220,505,"N/A",4.1500000000000004]
["M4G336DDA",null,"MEDIUM PROFILE","HOT GAS - REVERSE CYCLE",3,"DUAL SPEED EC MOTOR","208-230/1/60",4,-20,33600,38300,null,null,null,7040,"208-230/1/60",5.7,"208-230/1/60",19.3,4400,0.5,1.625,"-",15,20,"-","-",320,691,"N/A",4.1500000000000004]
["M4G419DDA",null,"MEDIUM PROFILE","HOT GAS - REVERSE CYCLE",3,"DUAL SPEED EC MOTOR","208-230/1/60",4,-20,41900,47600,null,null,null,6640,"208-230/1/60",5.7,"208-230/1/60",19.3,4400,0.625,1.625,"-",15,20,"-","-",320,691,"N/A",4.1500000000000004]
["M6G153FDA",null,"MEDIUM PROFILE","HOT GAS - REVERSE CYCLE",1,"DUAL SPEED EC MOTOR","460/1/60",6,-20,15300,17400,null,null,null,2250,"460/1/60",1.2,"460/1/60",3.2,1480,0.375,1.125,"-",15,20,"-","-",120,330,9,4.1500000000000004]
["M6G184FDA",null,"MEDIUM PROFILE","HOT GAS - REVERSE CYCLE",1,"DUAL SPEED EC MOTOR","460/1/60",6,-20,18400,21100,null,null,null,2090,"460/1/60",1.2,"460/1/60",3.2,1480,"3/8",1.125,"-",15,20,"-","-",120,330,9,4.1500000000000004]
["M6G311FDA",null,"MEDIUM PROFILE","HOT GAS - REVERSE CYCLE",2,"DUAL SPEED EC MOTOR","460/1/60",6,-20,31100,35700,null,null,null,4500,"460/1/60",2.4,"460/1/60",6.4,2960,"1/2",1.625,"-",15,20,"-","-",220,505,9,4.1500000000000004]
["M6G374FDA",null,"MEDIUM PROFILE","HOT GAS - REVERSE CYCLE",2,"DUAL SPEED EC MOTOR","460/1/60",6,-20,37400,42900,null,null,null,4180,"460/1/60",2.4,"460/1/60",6.4,2960,0.625,1.625,"-",15,20,"-","-",220,505,9,4.1500000000000004]
["M6G469FDA",null,"MEDIUM PROFILE","HOT GAS - REVERSE CYCLE",3,"DUAL SPEED EC MOTOR","460/1/60",6,-20,46900,53600,null,null,null,6750,"460/1/60",3.6,"460/1/60",9.6999999999999993,4400,"5/8",2.125,"-",15,20,"-","-",320,691,9,4.1500000000000004]
["M6G564FDA",null,"MEDIUM PROFILE","HOT GAS - REVERSE CYCLE",3,"DUAL SPEED EC MOTOR","460/1/60",6,-20,56400,64300,null,null,null,6270,"460/1/60",3.6,"460/1/60",9.6999999999999993,4400,"5/8",2.125,"-",15,20,"-","-",320,691,9,4.1500000000000004]
["M4G110FDA",null,"MEDIUM PROFILE","HOT GAS - REVERSE CYCLE",1,"DUAL SPEED EC MOTOR","460/1/60",4,-20,11000,12400,null,null,null,2350,"460/1/60",1.2,"460/1/60",3.2,1480,"3/8",1.125,"-",15,20,"-","-",120,330,"N/A",4.1500000000000004]
["M4G143FDA",null,"MEDIUM PROFILE","HOT GAS - REVERSE CYCLE",1,"DUAL SPEED EC MOTOR","460/1/60",4,-20,14300,16200,null,null,null,2210,"460/1/60",1.2,"460/1/60",3.2,1480,"3/8",1.125,"-",15,20,"-","-",120,330,"N/A",4.1500000000000004]
["M4G232FDA",null,"MEDIUM PROFILE","HOT GAS - REVERSE CYCLE",2,"DUAL SPEED EC MOTOR","460/1/60",4,-20,23200,26100,null,null,null,4690,"460/1/60",2.4,"460/1/60",6.4,2960,0.5,1.375,"-",15,20,"-","-",220,505,"N/A",4.1500000000000004]
["M4G288FDA",null,"MEDIUM PROFILE","HOT GAS - REVERSE CYCLE",2,"DUAL SPEED EC MOTOR","460/1/60",4,-20,28800,32700,null,null,null,4420,"460/1/60",2.4,"460/1/60",6.4,2960,0.5,1.375,"-",15,20,"-","-",220,505,"N/A",4.1500000000000004]
["M4G336FDA",null,"MEDIUM PROFILE","HOT GAS - REVERSE CYCLE",3,"DUAL SPEED EC MOTOR","460/1/60",4,-20,33600,38300,null,null,null,7040,"460/1/60",3.6,"460/1/60",9.6999999999999993,4400,0.5,1.625,"-",15,20,"-","-",320,691,"N/A",4.1500000000000004]
["M4G419FDA",null,"MEDIUM PROFILE","HOT GAS - REVERSE CYCLE",3,"DUAL SPEED EC MOTOR","460/1/60",4,-20,41900,47600,null,null,null,6640,"460/1/60",3.6,"460/1/60",9.6999999999999993,4400,0.625,1.625,"-",15,20,"-","-",320,691,"N/A",4.1500000000000004]
["M6D181DDA",null,"MEDIUM PROFILE","ELECTRIC DEFROST-MT",1,"DUAL SPEED EC MOTOR","208-230/1/60",6,25,18200,21100,null,null,null,3190,"208-230/1/60",1.9,"208-230/1/60",19.5,4480,"3/8","7/8","-",15,20,15,20,120,330,9,"N/A"]
["M6D219DDA",null,"MEDIUM PROFILE","ELECTRIC DEFROST-MT",1,"DUAL SPEED EC MOTOR","208-230/1/60",6,25,22000,25800,null,null,null,2950,"208-230/1/60",1.9,"208-230/1/60",19.5,4480,"3/8","7/8","-",15,20,15,20,120,330,9,"N/A"]
["M6D181EDA",null,"MEDIUM PROFILE","ELECTRIC DEFROST-MT",1,"DUAL SPEED EC MOTOR","208-230/3/60",6,25,18200,21100,null,null,null,3190,"208-230/1/60",1.9,"208-230/3/60",11.2,4480,"3/8","7/8","-",15,20,15,20,120,330,9,"N/A"]
["M6D219EDA",null,"MEDIUM PROFILE","ELECTRIC DEFROST-MT",1,"DUAL SPEED EC MOTOR","208-230/3/60",6,25,22000,25800,null,null,null,2950,"208-230/1/60",1.9,"208-230/3/60",11.2,4480,"3/8","7/8","-",15,20,15,20,120,330,9,"N/A"]
["M6D181FDA",null,"MEDIUM PROFILE","ELECTRIC DEFROST-MT",1,"DUAL SPEED EC MOTOR","460/1/60",6,25,18200,21100,null,null,null,3190,"460/1/60",1.2,"460/1/60",9.6999999999999993,4480,"3/8","7/8","-",15,20,15,20,120,330,9,"N/A"]
["M6D219FDA",null,"MEDIUM PROFILE","ELECTRIC DEFROST-MT",1,"DUAL SPEED EC MOTOR","460/1/60",6,25,22000,25800,null,null,null,2950,"460/1/60",1.2,"460/1/60",9.6999999999999993,4480,"3/8","7/8","-",15,20,15,20,120,330,9,"N/A"]
["M6D181GDA",null,"MEDIUM PROFILE","ELECTRIC DEFROST-MT",1,"DUAL SPEED EC MOTOR","460/3/60",6,25,18200,21100,null,null,null,3190,"460/1/60",1.2,"460/3/60",5.6,4480,"3/8","7/8","-",15,20,15,20,120,330,9,"N/A"]
["M6D219GDA",null,"MEDIUM PROFILE","ELECTRIC DEFROST-MT",1,"DUAL SPEED EC MOTOR","460/3/60",6,25,22000,25800,null,null,null,2950,"460/1/60",1.2,"460/3/60",5.6,4480,"3/8","7/8","-",15,20,15,20,120,330,9,"N/A"]
["M6D275DDA",null,"MEDIUM PROFILE","ELECTRIC DEFROST-MT",2,"DUAL SPEED EC MOTOR","208-230/1/60",6,25,27600,32300,null,null,null,6950,"208-230/1/60",3.8,"208-230/1/60",38.5,8860,"1/2","1-1/8","-",15,20,40.5,45,220,505,9,"N/A"]
["M6D369DDA",null,"MEDIUM PROFILE","ELECTRIC DEFROST-MT",2,"DUAL SPEED EC MOTOR","208-230/1/60",6,25,37000,43100,null,null,null,6380,"208-230/1/60",3.8,"208-230/1/60",38.5,8860,"1/2","1-1/8","-",15,20,40.5,45,220,505,9,"N/A"]
["M6D441DDA",null,"MEDIUM PROFILE","ELECTRIC DEFROST-MT",2,"DUAL SPEED EC MOTOR","208-230/1/60",6,25,44200,51900,null,null,null,5900,"208-230/1/60",3.8,"208-230/1/60",38.5,8860,"1/2","1-1/8","-",15,20,40.5,45,220,505,9,"N/A"]
["M6D275EDA",null,"MEDIUM PROFILE","ELECTRIC DEFROST-MT",2,"DUAL SPEED EC MOTOR","208-230/3/60",6,25,27600,32300,null,null,null,6950,"208-230/1/60",3.8,"208-230/3/60",22.2,8860,"1/2","1-1/8","-",15,20,23.2,25,220,505,9,"N/A"]
["M6D369EDA",null,"MEDIUM PROFILE","ELECTRIC DEFROST-MT",2,"DUAL SPEED EC MOTOR","208-230/3/60",6,25,37000,43100,null,null,null,6380,"208-230/1/60",3.8,"208-230/3/60",22.2,8860,"1/2","1-1/8","-",15,20,23.2,25,220,505,9,"N/A"]
["M6D441EDA",null,"MEDIUM PROFILE","ELECTRIC DEFROST-MT",2,"DUAL SPEED EC MOTOR","208-230/3/60",6,25,44200,51900,null,null,null,5900,"208-230/1/60",3.8,"208-230/3/60",22.2,8860,"1/2","1-1/8","-",15,20,23.2,25,220,505,9,"N/A"]
["M6D275FDA",null,"MEDIUM PROFILE","ELECTRIC DEFROST-MT",2,"DUAL SPEED EC MOTOR","460/1/60",6,25,27600,32300,null,null,null,6950,"460/1/60",2.4,"460/1/60",19.3,8860,"1/2","1-1/8","-",15,20,20.3,25,220,505,9,"N/A"]
["M6D369FDA",null,"MEDIUM PROFILE","ELECTRIC DEFROST-MT",2,"DUAL SPEED EC MOTOR","460/1/60",6,25,37000,43100,null,null,null,6380,"460/1/60",2.4,"460/1/60",19.3,8860,"1/2","1-1/8","-",15,20,20.3,25,220,505,9,"N/A"]
["M6D441FDA",null,"MEDIUM PROFILE","ELECTRIC DEFROST-MT",2,"DUAL SPEED EC MOTOR","460/1/60",6,25,44200,51900,null,null,null,5900,"460/1/60",2.4,"460/1/60",19.3,8860,"1/2","1-1/8","-",15,20,20.3,25,220,505,9,"N/A"]
["M6D275GDA",null,"MEDIUM PROFILE","ELECTRIC DEFROST-MT",2,"DUAL SPEED EC MOTOR","460/3/60",6,25,27600,32300,null,null,null,6950,"460/1/60",2.4,"460/3/60",11.1,8860,"1/2","1-1/8","-",15,20,15,20,220,505,9,"N/A"]
["M6D369GDA",null,"MEDIUM PROFILE","ELECTRIC DEFROST-MT",2,"DUAL SPEED EC MOTOR","460/3/60",6,25,37000,43100,null,null,null,6380,"460/1/60",2.4,"460/3/60",11.1,8860,"1/2","1-1/8","-",15,20,15,20,220,505,9,"N/A"]
["M6D441GDA",null,"MEDIUM PROFILE","ELECTRIC DEFROST-MT",2,"DUAL SPEED EC MOTOR","460/3/60",6,25,44200,51900,null,null,null,5900,"460/1/60",2.4,"460/3/60",11.1,8860,"1/2","1-1/8","-",15,20,15,20,220,505,9,"N/A"]
["M6D548EDA",null,"MEDIUM PROFILE","ELECTRIC DEFROST-MT",3,"DUAL SPEED EC MOTOR","208-230/3/60",6,25,54900,64200,null,null,null,9580,"208-230/1/60",5.7,"208-230/3/60",33.5,13340,"5/8","1-3/8","-",15,20,35.5,40,320,691,9,"N/A"]
["M6D657EDA",null,"MEDIUM PROFILE","ELECTRIC DEFROST-MT",3,"DUAL SPEED EC MOTOR","208-230/3/60",6,25,65800,76900,null,null,null,8860,"208-230/1/60",5.7,"208-230/3/60",33.5,13340,"5/8","1-3/8","-",15,20,35.5,40,320,691,9,"N/A"]
["M6D548FDA",null,"MEDIUM PROFILE","ELECTRIC DEFROST-MT",3,"DUAL SPEED EC MOTOR","460/1/60",6,25,54900,64200,null,null,null,9580,"460/1/60",3.6,"460/1/60",29,13340,"5/8","1-3/8","-",15,20,30,35,320,691,9,"N/A"]
["M6D657FDA",null,"MEDIUM PROFILE","ELECTRIC DEFROST-MT",3,"DUAL SPEED EC MOTOR","460/1/60",6,25,65800,76900,null,null,null,8860,"460/1/60",3.6,"460/1/60",29,13340,"5/8","1-3/8","-",15,20,30,35,320,691,9,"N/A"]
["M6D548GDA",null,"MEDIUM PROFILE","ELECTRIC DEFROST-MT",3,"DUAL SPEED EC MOTOR","460/3/60",6,25,54900,64200,null,null,null,9580,"460/1/60",3.6,"460/3/60",16.7,13340,"5/8","1-3/8","-",15,20,17.7,20,320,691,9,"N/A"]
["M6D657GDA",null,"MEDIUM PROFILE","ELECTRIC DEFROST-MT",3,"DUAL SPEED EC MOTOR","460/3/60",6,25,65800,76900,null,null,null,8860,"460/1/60",3.6,"460/3/60",16.7,13340,"5/8","1-3/8","-",15,20,17.7,20,320,691,9,"N/A"]

{"sheet":"All Temp Options","index":6,"n_rows":28,"n_cols":5,"rows_kept":28,"cut":false,"hidden":true,"merged":[]}
[]
[]
[]
[]
[]
[]
[]
[]
[null,null,"Generic Option Name"]
[null,null,{"$f":"IF(OR(Submital!F14=\"Hot Gas - 3 Pipe\",Submital!F14=\"Hot Gas - Reverse Cycle\"),\"\",\"EcoNet\")","v":"EcoNet"}]
[null,null,{"$f":"IF(OR(Submital!F14=\"Hot Gas - 3 Pipe\",Submital!F14=\"Hot Gas - Reverse Cycle\"),\"\",\"EcoNet Command Center - Loose\")","v":"EcoNet Command Center - Loose"}]
[null,null,"Mechanical Thermostat - Mounted",null,"Hot Gas - 3 Pipe"]
[null,null,"Electronic Room Thermostat - Mounted",null,"Hot Gas - Reverse Cycle"]
[null,null,"Thermostatic Expanion Valve - Mounted"]
[null,null,"Electronic Expansion Valve - Mounted"]
[null,null,"Liquid Line Solenoid Valve - Mounted"]
[null,null,"Mechanical Thermostat - Loose"]
[null,null,"Electronic Room Thermostat - Loose"]
[null,null,"Thermostatic Expansion Valve - Loose"]
[null,null,"Electronic Expanison Valve - Loose"]
[null,null,"Liquid Line Solenoid Valve - Loose"]
[null,null,"Heat Exchanger HX-25 - Loose"]
[null,null,"Heat Exchanger HX-50 - Loose"]
[null,null,"Heat Exchanger HX-75 - Loose"]
[null,null,"Heat Exchanger HX-100 - Loose"]
[null,null,"Heat Exchanger HX-150 - Loose"]
[null,null,"Heat Exchanger HX-250 - Loose"]
[null,null,"Heat Exchanger HX-350 - Loose"]

{"sheet":"Pics","index":7,"n_rows":21,"n_cols":5,"rows_kept":21,"cut":false,"hidden":true,"merged":[]}
[]
[]
[]
[null,null,1]
[null,null,2]
[null,null,3]
[]
[]
[]
[]
[]
[]
[]
[]
[]
[]
[]
[null,null,null,null,"Russell"]
[null,null,null,null,"Witt"]
[null,null,null,null,"Kramer"]
[null,null,null,null,"ColdZone"]