{"text_format":"1","workbook":"xlsx","n_sheets":6,"sheets":["Submital","Sheet1","REVISION","SUBMITTAL DATA","All Temp Options","Pics"],"not_rendered":{"charts":0,"images":19,"macros":1,"external_links":0,"defined_names":20,"comments":0,"pivot_tables":0},"unopened":[],"bounds":{"document_bytes":16777216,"sheet_cells":100000,"rows_first":2000,"rows_last":500,"rows_between":2000,"halvings":0,"cell_chars":16384,"cell_head_chars":4096},"cells_cut":0,"cells_raw":0,"read":"whole","date_system":"1900"}

{"sheet":"Submital","index":0,"n_rows":100,"n_cols":37,"rows_kept":100,"cut":false,"hidden":false,"merged":[[41,33,41,34],[41,35,41,36],[71,16,71,17],[5,11,5,13],[5,0,5,7],[6,0,6,4],[7,0,7,4],[8,0,8,4],[6,11,6,13],[7,11,7,13],[8,11,8,13],[6,5,6,7],[7,5,7,7],[6,8,6,10],[7,8,7,10],[8,8,8,10],[8,5,8,7],[14,0,14,13],[10,5,10,7],[13,12,13,13],[12,5,12,7],[13,5,13,7],[9,11,9,13],[9,5,9,7],[10,11,10,13],[10,8,10,10],[12,10,12,11],[13,10,13,11],[9,8,9,10],[13,2,13,3],[11,0,11,13],[12,0,12,1],[12,12,12,13],[13,0,13,1],[4,6,4,10],[4,12,4,13],[0,0,4,5],[0,6,0,10],[0,11,0,13],[1,6,1,10],[1,11,1,13],[2,6,2,10],[2,11,2,13],[3,6,3,10],[3,12,3,13],[5,8,5,10],[9,0,9,4],[10,0,10,4],[15,0,29,13],[31,0,32,1],[33,0,33,1],[31,7,32,7],[31,6,32,6],[31,2,32,2],[31,8,32,8],[31,3,31,5],[31,9,32,9],[31,10,32,10],[31,11,32,11],[30,2,30,11],[12,2,12,3],[50,0,50,1],[39,0,39,13],[37,0,37,1],[35,0,36,1],[35,9,36,9],[35,10,36,10],[43,0,43,13],[40,8,40,13],[41,8,41,13],[42,8,42,13],[40,6,42,7],[40,0,40,5],[41,0,41,5],[42,0,42,5],[35,11,36,11],[34,0,34,11],[35,13,36,13],[49,0,49,1],[35,2,36,3],[37,2,37,3],[35,8,36,8],[35,12,36,12],[35,6,36,7],[37,6,37,7],[35,4,36,4],[35,5,36,5],[38,0,38,13],[48,0,48,8],[44,0,44,13],[45,0,47,13]]}
[null,null,null,null,null,null,"HEAT TRANSFER PRODUCTS GROUP, LLC",null,null,null,null,"SUBMITTAL DATA SHEET"]
[null,null,null,null,null,null,"3885 Crestwood Parkway / Suite 500",null,null,null,null,"WAREHOUSE",null,null,null,null,null,"HIGH STATIC",true]
[null,null,null,null,null,null,"Duluth, GA  30096",null,null,null,null,"UNIT COOLER"]
[null,null,null,null,null,null,"(P) 800-288-9488 / (F) 256-259-7478",null,null,null,null,null,"For Record Only",null,null,null,null,null,null,"T5 IS TEST FOR HIGH STATIC BECAUSE I WAS HAVING TROUBLE WITH DROP LIST SELECTION BEING STATIC AND CHANGING OPTOIN AND GETTING A FALSE VALID SELECTION"]
[null,null,null,null,null,null,"https://www.htpg.com/",null,null,null,null,null,"For Approval",null,null,null,null,null,null,{"$f":"IF(AND(T96>=1,'All Temp Options'!C21=\"\"),FALSE,TRUE)","v":true}]
[{"$f":"\"Rev. \"","v":"Rev. "},null,null,null,null,null,null,null,null,null,null,null,null,null,null,null,null,null,null,{"$f":"IF(T5=FALSE,FALSE,IF(T96=0,\"T\",\"H\"))","v":"T"}]
["Job Name:",null,null,null,null,null,null,null,"Job Location:"]
["Customer Name:"]
["Architect / Engineer:",null,null,null,null,null,null,null,"Prepared By:"]
["Unit Model Number:",null,null,null,null,{"$f":"IFERROR(R41,\"\")","v":""},null,null,"Tagging Info:"]
["Unit Quantity:",null,null,null,null,null,null,null,"Date:",null,null,{"$f":"TODAY()","v":"2024-09-20"}]
["Select unit attributes from the application option above and the drop down menus below to build required model number"]
["Brand",null,"Motor Type",null,"FPI","Defrost Type",null,null,"SST","Refrig.",{"$f":"\"R-\"&J14&\" Adjusted Capacity (BTUH) @ 10F TD\"","v":"R-448A Adjusted Capacity (BTUH) @ 10F TD"},null,"Unit Voltage"]
["Witt",null,"3-Ph Std Motor",null,6,"Electric- Low Temperature",null,null,"25","448A",282500,null,"208-230/3/60"]
["**clear all  fields when starting over**",null,null,null,null,null,null,null,null,null,null,null,null,null,null,null,"Russell","R","3-Ph Std Motor","T",null,null,null,{"$f":"IF(OR(E14=\"\",E14=6),\"Air\",\"\")","v":"Air"},"A",4,null,"404A","A",null,"208-230/3/60","E"]
[null,null,null,null,null,null,null,null,null,null,null,null,null,null,null,null,"Witt","W","3-Ph High Static","H",null,null,null,{"$f":"IF(C14=\"3-Ph Std Motor\",\"Electric- Medium Temperature\",\"\")","v":"Electric- Medium Temperature"},"D",6,null,"407A","E",null,"460/3/60","G"]
[null,null,null,null,null,null,null,null,null,null,null,null,null,null,null,null,"Kramer","K",null,null,null,null,null,"Electric- Low Temperature","E",null,null,"448A","E",null,"575/3/60","J"]
[null,null,null,null,null,null,null,null,null,null,null,null,null,null,null,null,"ColdZone","C",null,null,null,null,null,"Hot Gas - 3 Pipe - Elec. Drain Pan","H",null,null,"449A","E"]
[null,null,null,null,null,null,null,null,null,null,null,null,null,null,null,null,null,null,null,null,null,null,null,"Hot Gas - 3 Pipe - H.G. Drain Pain","K",null,null,"449B","E"]
[null,null,null,null,null,null,null,null,null,null,null,null,null,null,null,null,null,null,null,null,null,null,null,"Hot Gas - Reverse Cycle - Elec. Drain Pan","G"]
[null,null,null,null,null,null,null,null,null,null,null,null,null,null,null,null,null,null,null,null,null,null,null,"Hot Gas - Reverse Cycle - H.G. Drain Pain","L"]
[null,null,null,null,null,null,null,null,null,null,null,null,null,null,null,null,null,null,null,null,null,null,null,{"$f":"IF(A14=\"KRAMER\",\"Thermobank\",\"\")","v":""},"T"]
[null,null,null,null,null,null,null,null,null,null,null,null,null,null,null,null,null,null,null,null,null,null,null,{"$f":"IF(A14=\"KRAMER\",\"Thermobank-Medium Temperature\",\"\")","v":""},"S"]
[null,null,null,null,null,null,null,null,null,null,null,null,null,null,null,null,null,null,null,null,null,null,null,"Hot Gas - 3 Pipe - Elec. Drain Pan MT","B"]
[null,null,null,null,null,null,null,null,null,null,null,null,null,null,null,null,null,null,null,null,null,null,null,"Hot Gas - 3 Pipe - H.G. Drain Pain MT","C"]
[null,null,null,null,null,null,null,null,null,null,null,null,null,null,null,null,null,null,null,null,null,null,null,"Hot Gas - Reverse Cycle - Elec. Drain Pan MT","M"]
[null,null,null,null,null,null,null,null,null,null,null,null,null,null,null,null,null,null,null,null,null,null,null,"Hot Gas - Reverse Cycle - H.G. Drain Pain MT","N",null,null,"shows 744 in list","No"]
[]
[]
[]
[null,null,"Physical Data"]
["Base Model",null,"Fins/Inch","Refrig. Conn (ODS)",null,null,"Net Weight","Ship Weight ","Number of Fans","Air Throw","CFM","Fan Diameter"]
[null,null,null,"Liquid","Suction","Hot Gas"]
[{"$f":"IFERROR(\"W\"&E14&S38&T38,\"\")","v":""},null,{"$f":"IF(E14=0,\"\",E14)","v":6},{"$f":"IFERROR(VLOOKUP(S41,'SUBMITTAL DATA'!A2:AE1000,21,FALSE),\"\")","v":""},{"$f":"IFERROR(VLOOKUP(S41,'SUBMITTAL DATA'!A2:AE1000,22,FALSE),\"\")","v":""},{"$f":"IFERROR(VLOOKUP(S41,'SUBMITTAL DATA'!A2:AE1000,23,FALSE),\"\")","v":""},{"$f":"IFERROR(VLOOKUP(S41,'SUBMITTAL DATA'!A2:AE1000,28,FALSE),\"\")","v":""},{"$f":"IFERROR(VLOOKUP(S41,'SUBMITTAL DATA'!A2:AE1000,29,FALSE),\"\")","v":""},{"$f":"IFERROR(VLOOKUP(S41,'SUBMITTAL DATA'!A2:AE1000,5,FALSE),\"\")","v":""},{"$f":"IF(F10=\"\",\"\",\"120'\")","v":""},{"$f":"IFERROR(VLOOKUP(S41,'SUBMITTAL DATA'!A2:AE1000,13,FALSE),\"\")","v":""},{"$f":"IF(F10=\"\",\"\",\"30\"\"\")","v":""}]
["Electrical Data"]
["Motor Voltage",null,"Total Motor Amps",null,{"$f":"IF(Q68>=1,\"EcoNet MCA\",\"Motor Circuit MCA\")","v":"Motor Circuit MCA"},{"$f":"IF(Q68>=1,\"EcoNet MOPD\",\"Motor Circuit MOPD\")","v":"Motor Circuit MOPD"},"Heater Voltage",null,"Number of Heater Circuits","Heater Amps Each Circuit","Total Heater Amps","Heater Watts"]
[null,null,null,null,null,null,null,null,null,null,null,null,null,null,null,null,"Brand",{"$f":"Submital!A14","v":"Witt"},"Defrost","Capacity",null,"Voltage","Motor","Refrigerant"]
[{"$f":"IFERROR(VLOOKUP(S41,'SUBMITTAL DATA'!A2:AE1000,14,FALSE),\"\")","v":""},null,{"$f":"IFERROR(VLOOKUP(S41,'SUBMITTAL DATA'!A2:AE1000,15,FALSE),\"\")","v":""},null,{"$f":"IFERROR(VLOOKUP(S41,'SUBMITTAL DATA'!A2:AE1000,IF(Q68>=1,26,24),FALSE),\"\")","v":""},{"$f":"IFERROR(VLOOKUP(S41,'SUBMITTAL DATA'!A2:AE1000,IF(Q68>=1,27,25),FALSE),\"\")","v":""},{"$f":"IFERROR(VLOOKUP(S41,'SUBMITTAL DATA'!A2:AE1000,16,FALSE),\"\")","v":""},null,{"$f":"IFERROR(VLOOKUP(S41,'SUBMITTAL DATA'!A2:AE1000,17,FALSE),\"\")","v":""},{"$f":"IFERROR(VLOOKUP(S41,'SUBMITTAL DATA'!A2:AE1000,18,FALSE),\"\")","v":""},{"$f":"IFERROR(VLOOKUP(S41,'SUBMITTAL DATA'!A2:AE1000,19,FALSE),\"\")","v":""},{"$f":"IFERROR(VLOOKUP(S41,'SUBMITTAL DATA'!A2:AE1000,20,FALSE),\"\")","v":""},null,null,null,null," ",{"$f":"VLOOKUP(R37,Q15:R18,2,FALSE)","v":"W"},{"$f":"VLOOKUP(F14,X15:Y22,2,FALSE)","v":"E"},{"$f":"IF(T39<100000,\"0\"&LEFT(T39,LEN(T39)-3),LEFT(T39,LEN(T39)-3))","v":{"$error":"#N/A"}},null,{"$f":"VLOOKUP(M14,AE15:AF17,2,FALSE)","v":"E"},{"$f":"VLOOKUP(C14,S15:T16,2,FALSE)","v":"T"},{"$f":"VLOOKUP($J$14,AB15:AC19,2,FALSE)","v":"E"}]
["APPLICATION NOTE: WAREHOUSE UNIT COOLERS ARE DESIGNED EXCLUSIVELY FOR APLLICATIONS 3,000 SQUARE FEET AND LARGER.",null,null,null,null,null,null,null,null,null,null,null,null,null,null,null,null,null,null,{"$f":"R60","v":{"$error":"#N/A"}}]
["Options (Select catalog options from drop down menu.)",null,null,null,null,null,null,null,null,null,null,null,null,null,null,null,null,"Unit Model Num.","Lookup",null,null,null,null,"Temperature"]
{"$rows_left_out":61}
{"sheet":"Sheet1","index":1,"n_rows":0,"n_cols":0,"rows_kept":0,"cut":false,"hidden":true,"merged":[]}

{"sheet":"REVISION","index":2,"n_rows":10,"n_cols":3,"rows_kept":10,"cut":false,"hidden":true,"merged":[]}
[]
[1,"2020-07-29","INITIAL RELEASE"]
[1.01,"2020-08-25","corrected macro error, added additional notes field"]
[1.02,"2021-04-01","corrected an error with the look up table submittal - T48:U55"]
[1.03,"2023-08-25","Sloped Drain Pan"]
[1.04,"2023-11-28","Medium Temp Electric Defrost"]
[1.05,"2024-01-30","Remove High Static Option from WH Medium Temp Electric Defrost"]
[1.05,"2024-01-30","Add 4FPI to WH Medium Temp Electric Defrost"]
[1.05,"2024-01-30","Adjust Model Numbers for WH Medium Temp Electric Defrost (-1)"]
[1.06,"2024-06-25","Revised medium temp capacity from 207900  to 206900 on the 4FPI RW4D206GTA"]

{"sheet":"SUBMITTAL DATA","index":3,"n_rows":774,"n_cols":31,"rows_kept":774,"cut":false,"hidden":true,"merged":[]}
["LOOKUP","FAN TYPE","MODEL FAMILY","DEFROST TYPE","NUMBER OF FANS","MOTOR TYPE","UNIT VOLTAGE","FPI","SST","R404A CAPACITY","R407A/R448A/R449A CAPACITY",null,"CFM","MOTOR VOLTAGE","TOTAL UNIT FAN MOTOR AMPS","HEATER VOLTAGE","Number of Heater Circuits","HEATER AMPS EACH CIRCUIT","Total Heater Amps","HEATER WATTS","LIQUID LINE SIZE","SUCTION LINE SIZE","3-PIPE HG LINE","MCA - NO-ECONET","MOPD - NO-ECONET","MCA - ECONET","MOPD - ECONET","NET WEIGHT","APPROX. SHIP WEIGHT","AWEF CLR","AWEF FRZR"]
["W4E038EHA","HIGH STATIC","WAREHOUSE","ELECTRIC DEFROST- LOW TEMP",1,"THREE PHASE MOTOR","208-230/3/60",4,-20,38300,43600,"-",7010,"208-230/3/60",6.4,"208-230/3/60",1,14.4,14.4,6000,"1/2","2-1/8","-",15,20,16.399999999999999,20,303,480,"N/A","N/A"]
["W4E038ETA","STANDARD","WAREHOUSE","ELECTRIC DEFROST- LOW TEMP",1,"THREE PHASE MOTOR","208-230/3/60",4,-20,38300,43600,"-",7010,"208-230/3/60",4.0999999999999996,"208-230/3/60",1,14.4,14.4,6000,"1/2","2-1/8","-",15,20,16.399999999999999,20,303,480,"N/A","N/A"]
["W4E038GHA","HIGH STATIC","WAREHOUSE","ELECTRIC DEFROST- LOW TEMP",1,"THREE PHASE MOTOR","460/3/60",4,-20,38300,43600,"-",7010,"460/3/60",3.2,"460/3/60",1,7.5,7.5,6000,"1/2","2-1/8","-",15,20,15,20,303,480,"N/A","N/A"]
["W4E038GTA","STANDARD","WAREHOUSE","ELECTRIC DEFROST- LOW TEMP",1,"THREE PHASE MOTOR","460/3/60",4,-20,38300,43600,"-",7010,"460/3/60",2,"460/3/60",1,7.5,7.5,6000,"1/2","2-1/8","-",15,20,15,20,303,480,"N/A","N/A"]
["W4E038JHA","HIGH STATIC","WAREHOUSE","ELECTRIC DEFROST- LOW TEMP",1,"THREE PHASE MOTOR","575/3/60",4,-20,38300,43600,"-",7010,"575/3/60",3,"575/3/60",1,6,6,6000,"1/2","2-1/8","-",15,20,15,20,303,480,"N/A","N/A"]
["W4E038JTA","STANDARD","WAREHOUSE","ELECTRIC DEFROST- LOW TEMP",1,"THREE PHASE MOTOR","575/3/60",4,-20,38300,43600,"-",7010,"575/3/60",2.5,"575/3/60",1,6,6,6000,"1/2","2-1/8","-",15,20,15,20,303,480,"N/A","N/A"]
["W4E048EHA","HIGH STATIC","WAREHOUSE","ELECTRIC DEFROST- LOW TEMP",1,"THREE PHASE MOTOR","208-230/3/60",4,-20,48900,56000,"-",6875,"208-230/3/60",6.4,"208-230/3/60",1,14.4,14.4,6000,"5/8","2-1/8","-",15,20,16.399999999999999,20,303,480,"N/A","N/A"]
["W4E048ETA","STANDARD","WAREHOUSE","ELECTRIC DEFROST- LOW TEMP",1,"THREE PHASE MOTOR","208-230/3/60",4,-20,48900,56000,"-",6875,"208-230/3/60",4.0999999999999996,"208-230/3/60",1,14.4,14.4,6000,"5/8","2-1/8","-",15,20,16.399999999999999,20,303,480,"N/A","N/A"]
["W4E048GHA","HIGH STATIC","WAREHOUSE","ELECTRIC DEFROST- LOW TEMP",1,"THREE PHASE MOTOR","460/3/60",4,-20,48900,56000,"-",6875,"460/3/60",3.2,"460/3/60",1,7.5,7.5,6000,"5/8","2-1/8","-",15,20,15,20,303,480,"N/A","N/A"]
["W4E048GTA","STANDARD","WAREHOUSE","ELECTRIC DEFROST- LOW TEMP",1,"THREE PHASE MOTOR","460/3/60",4,-20,48900,56000,"-",6875,"460/3/60",2,"460/3/60",1,7.5,7.5,6000,"5/8","2-1/8","-",15,20,15,20,303,480,"N/A","N/A"]
["W4E048JHA","HIGH STATIC","WAREHOUSE","ELECTRIC DEFROST- LOW TEMP",1,"THREE PHASE MOTOR","575/3/60",4,-20,48900,56000,"-",6875,"575/3/60",3,"575/3/60",1,6,6,6000,"5/8","2-1/8","-",15,20,15,20,303,480,"N/A","N/A"]
["W4E048JTA","STANDARD","WAREHOUSE","ELECTRIC DEFROST- LOW TEMP",1,"THREE PHASE MOTOR","575/3/60",4,-20,48900,56000,"-",6875,"575/3/60",2.5,"575/3/60",1,6,6,6000,"5/8","2-1/8","-",15,20,15,20,303,480,"N/A","N/A"]
["W4E077EHA","HIGH STATIC","WAREHOUSE","ELECTRIC DEFROST- LOW TEMP",2,"THREE PHASE MOTOR","208-230/3/60",4,-20,77300,88600,"-",14030,"208-230/3/60",12.8,"208-230/3/60",1,28.9,28.9,12000,"5/8","2-1/8","-",15,20,30.9,35,509,750,"N/A","N/A"]
["W4E077ETA","STANDARD","WAREHOUSE","ELECTRIC DEFROST- LOW TEMP",2,"THREE PHASE MOTOR","208-230/3/60",4,-20,77300,88600,"-",14030,"208-230/3/60",8.1999999999999993,"208-230/3/60",1,28.9,28.9,12000,"5/8","2-1/8","-",15,20,30.9,35,509,750,"N/A","N/A"]
["W4E077GHA","HIGH STATIC","WAREHOUSE","ELECTRIC DEFROST- LOW TEMP",2,"THREE PHASE MOTOR","460/3/60",4,-20,77300,88600,"-",14030,"460/3/60",6.4,"460/3/60",1,15.1,15.1,12000,"5/8","2-1/8","-",15,20,16.100000000000001,20,509,750,"N/A","N/A"]
["W4E077GTA","STANDARD","WAREHOUSE","ELECTRIC DEFROST- LOW TEMP",2,"THREE PHASE MOTOR","460/3/60",4,-20,77300,88600,"-",14030,"460/3/60",4,"460/3/60",1,15.1,15.1,12000,"5/8","2-1/8","-",15,20,16.100000000000001,20,509,750,"N/A","N/A"]
["W4E077JHA","HIGH STATIC","WAREHOUSE","ELECTRIC DEFROST- LOW TEMP",2,"THREE PHASE MOTOR","575/3/60",4,-20,77300,88600,"-",14030,"575/3/60",6,"575/3/60",1,12,12,12000,"5/8","2-1/8","-",15,20,15,20,509,750,"N/A","N/A"]
["W4E077JTA","STANDARD","WAREHOUSE","ELECTRIC DEFROST- LOW TEMP",2,"THREE PHASE MOTOR","575/3/60",4,-20,77300,88600,"-",14030,"575/3/60",5,"575/3/60",1,12,12,12000,"5/8","2-1/8","-",15,20,15,20,509,750,"N/A","N/A"]
["W4E097EHA","HIGH STATIC","WAREHOUSE","ELECTRIC DEFROST- LOW TEMP",2,"THREE PHASE MOTOR","208-230/3/60",4,-20,97000,111000,"-",13750,"208-230/3/60",12.8,"208-230/3/60",1,28.9,28.9,12000,"7/8","3-1/8","-",15,20,30.9,35,509,750,"N/A","N/A"]
["W4E097ETA","STANDARD","WAREHOUSE","ELECTRIC DEFROST- LOW TEMP",2,"THREE PHASE MOTOR","208-230/3/60",4,-20,97000,111000,"-",13750,"208-230/3/60",8.1999999999999993,"208-230/3/60",1,28.9,28.9,12000,"7/8","3-1/8","-",15,20,30.9,35,509,750,"N/A","N/A"]
["W4E097GHA","HIGH STATIC","WAREHOUSE","ELECTRIC DEFROST- LOW TEMP",2,"THREE PHASE MOTOR","460/3/60",4,-20,97000,111000,"-",13750,"460/3/60",6.4,"460/3/60",1,15.1,15.1,12000,"7/8","3-1/8","-",15,20,16.100000000000001,20,509,750,"N/A","N/A"]
["W4E097GTA","STANDARD","WAREHOUSE","ELECTRIC DEFROST- LOW TEMP",2,"THREE PHASE MOTOR","460/3/60",4,-20,97000,111000,"-",13750,"460/3/60",4,"460/3/60",1,15.1,15.1,12000,"7/8","3-1/8","-",15,20,16.100000000000001,20,509,750,"N/A","N/A"]
["W4E097JHA","HIGH STATIC","WAREHOUSE","ELECTRIC DEFROST- LOW TEMP",2,"THREE PHASE MOTOR","575/3/60",4,-20,97000,111000,"-",13750,"575/3/60",6,"575/3/60",1,12,12,12000,"7/8","3-1/8","-",15,20,15,20,509,750,"N/A","N/A"]
["W4E097JTA","STANDARD","WAREHOUSE","ELECTRIC DEFROST- LOW TEMP",2,"THREE PHASE MOTOR","575/3/60",4,-20,97000,111000,"-",13750,"575/3/60",5,"575/3/60",1,12,12,12000,"7/8","3-1/8","-",15,20,15,20,509,750,"N/A","N/A"]
["W4E115EHA","HIGH STATIC","WAREHOUSE","ELECTRIC DEFROST- LOW TEMP",3,"THREE PHASE MOTOR","208-230/3/60",4,-20,115600,131200,"-",21040,"208-230/3/60",19.2,"208-230/3/60",1,43.3,43.3,18000,"7/8","3-1/8","-",20.8,25,45.3,50,682,1030,"N/A","N/A"]
["W4E115ETA","STANDARD","WAREHOUSE","ELECTRIC DEFROST- LOW TEMP",3,"THREE PHASE MOTOR","208-230/3/60",4,-20,115600,131200,"-",21040,"208-230/3/60",12.3,"208-230/3/60",1,43.3,43.3,18000,"7/8","3-1/8","-",15,20,45.3,50,682,1030,"N/A","N/A"]
["W4E115GHA","HIGH STATIC","WAREHOUSE","ELECTRIC DEFROST- LOW TEMP",3,"THREE PHASE MOTOR","460/3/60",4,-20,115600,131200,"-",21040,"460/3/60",9.6,"460/3/60",1,22.6,22.6,18000,"7/8","3-1/8","-",15,20,23.6,25,682,1030,"N/A","N/A"]
["W4E115GTA","STANDARD","WAREHOUSE","ELECTRIC DEFROST- LOW TEMP",3,"THREE PHASE MOTOR","460/3/60",4,-20,115600,131200,"-",21040,"460/3/60",6,"460/3/60",1,22.6,22.6,18000,"7/8","3-1/8","-",15,20,23.6,25,682,1030,"N/A","N/A"]
["W4E115JHA","HIGH STATIC","WAREHOUSE","ELECTRIC DEFROST- LOW TEMP",3,"THREE PHASE MOTOR","575/3/60",4,-20,115600,131200,"-",21040,"575/3/60",9,"575/3/60",1,18.100000000000001,18.100000000000001,18000,"7/8","3-1/8","-",15,20,19.100000000000001,25,682,1030,"N/A","N/A"]
["W4E115JTA","STANDARD","WAREHOUSE","ELECTRIC DEFROST- LOW TEMP",3,"THREE PHASE MOTOR","575/3/60",4,-20,115600,131200,"-",21040,"575/3/60",7.5,"575/3/60",1,18.100000000000001,18.100000000000001,18000,"7/8","3-1/8","-",15,20,19.100000000000001,25,682,1030,"N/A","N/A"]
["W4E145EHA","HIGH STATIC","WAREHOUSE","ELECTRIC DEFROST- LOW TEMP",3,"THREE PHASE MOTOR","208-230/3/60",4,-20,145700,166400,"-",20625,"208-230/3/60",19.2,"208-230/3/60",1,43.3,43.3,18000,"1-1/8","3-1/8","-",20.8,25,45.3,50,682,1030,"N/A","N/A"]
["W4E145ETA","STANDARD","WAREHOUSE","ELECTRIC DEFROST- LOW TEMP",3,"THREE PHASE MOTOR","208-230/3/60",4,-20,145700,166400,"-",20625,"208-230/3/60",12.3,"208-230/3/60",1,43.3,43.3,18000,"1-1/8","3-1/8","-",15,20,45.3,50,682,1030,"N/A","N/A"]
["W4E145GHA","HIGH STATIC","WAREHOUSE","ELECTRIC DEFROST- LOW TEMP",3,"THREE PHASE MOTOR","460/3/60",4,-20,145700,166400,"-",20625,"460/3/60",9.6,"460/3/60",1,22.6,22.6,18000,"1-1/8","3-1/8","-",15,20,23.6,25,682,1030,"N/A","N/A"]
["W4E145GTA","STANDARD","WAREHOUSE","ELECTRIC DEFROST- LOW TEMP",3,"THREE PHASE MOTOR","460/3/60",4,-20,145700,166400,"-",20625,"460/3/60",6,"460/3/60",1,22.6,22.6,18000,"1-1/8","3-1/8","-",15,20,23.6,25,682,1030,"N/A","N/A"]
["W4E145JHA","HIGH STATIC","WAREHOUSE","ELECTRIC DEFROST- LOW TEMP",3,"THREE PHASE MOTOR","575/3/60",4,-20,145700,166400,"-",20625,"575/3/60",9,"575/3/60",1,18.100000000000001,18.100000000000001,18000,"1-1/8","3-1/8","-",15,20,19.100000000000001,25,682,1030,"N/A","N/A"]
["W4E145JTA","STANDARD","WAREHOUSE","ELECTRIC DEFROST- LOW TEMP",3,"THREE PHASE MOTOR","575/3/60",4,-20,145700,166400,"-",20625,"575/3/60",7.5,"575/3/60",1,18.100000000000001,18.100000000000001,18000,"1-1/8","3-1/8","-",15,20,19.100000000000001,25,682,1030,"N/A","N/A"]
["W4E182EHA","HIGH STATIC","WAREHOUSE","ELECTRIC DEFROST- LOW TEMP",4,"THREE PHASE MOTOR","208-230/3/60",4,-20,182200,206500,"-",27500,"208-230/3/60",25.6,"208-230/3/60",2,28.9,57.7,24000,"1-1/8","3-1/8","-",27.2,30,59.7,60,1050,1360,"N/A","N/A"]
["W4E182ETA","STANDARD","WAREHOUSE","ELECTRIC DEFROST- LOW TEMP",4,"THREE PHASE MOTOR","208-230/3/60",4,-20,182200,206500,"-",27500,"208-230/3/60",16.399999999999999,"208-230/3/60",2,28.9,57.7,24000,"1-1/8","3-1/8","-",17.399999999999999,20,59.7,60,1050,1360,"N/A","N/A"]
["W4E182GHA","HIGH STATIC","WAREHOUSE","ELECTRIC DEFROST- LOW TEMP",4,"THREE PHASE MOTOR","460/3/60",4,-20,182200,206500,"-",27500,"460/3/60",12.8,"460/3/60",1,30.1,30.1,24000,"1-1/8","3-1/8","-",15,20,31.1,35,1050,1360,"N/A","N/A"]
{"$rows_left_out":735}
{"sheet":"All Temp Options","index":4,"n_rows":28,"n_cols":5,"rows_kept":28,"cut":false,"hidden":true,"merged":[]}
[]
[]
[]
[]
[]
[]
[]
[null,null,"Generic Option Name"]
[null,null,{"$f":"IF(OR(Submital!F14=\"Hot Gas - 3 Pipe - Elec. Drain Pan\",Submital!F14=\"Hot Gas - 3 Pipe - H.G. Drain Pain\",Submital!F14=\"Hot Gas - Reverse Cycle - Elec. Drain Pan\",Submital!F14=\"Hot Gas - Reverse Cycle - H.G. Drain Pain\",Submital!F14=\"Thermobank\"),\"\",\"EcoNet\")","v":"EcoNet"}]
[null,null,{"$f":"IF(OR(Submital!F14=\"Hot Gas - 3 Pipe - Elec. Drain Pan\",Submital!F14=\"Hot Gas - 3 Pipe - H.G. Drain Pain\",Submital!F14=\"Hot Gas - Reverse Cycle - Elec. Drain Pan\",Submital!F14=\"Hot Gas - Reverse Cycle - H.G. Drain Pain\",Submital!F14=\"Thermobank\"),\"\",\"EcoNet Command Center - Loose\")","v":"EcoNet Command Center - Loose"}]
[null,null,"Mechanical Thermostat - Mounted",null,"Hot Gas - 3 Pipe - Elec. Drain Pan"]
[null,null,"Electronic Room Thermostat - Mounted",null,"Hot Gas - 3 Pipe - H.G. Drain Pain"]
[null,null,"Thermostatic Expanion Valve - Mounted",null,"Hot Gas - Reverse Cycle - Elec. Drain Pan"]
[null,null,"Electronic Expansion Valve - Mounted",null,"Hot Gas - Reverse Cycle - H.G. Drain Pain"]
[null,null,"Liquid Line Solenoid Valve - Mounted"]
[null,null,"Mechanical Thermostat - Loose"]
[null,null,"Electronic Room Thermostat - Loose"]
[null,null,"Thermostatic Expansion Valve - Loose"]
[null,null,"Electronic Expanison Valve - Loose"]
[null,null,"Liquid Line Solenoid Valve - Loose"]
[null,null,{"$f":"IF(AND(OR(Submital!F14=\"Electric\",Submital!F14=\"Hot Gas - 3 Pipe - Elec. Drain Pan\",Submital!F14=\"Hot Gas - 3 Pipe - H.G. Drain Pain\",Submital!F14=\"Hot Gas - Reverse Cycle - Elec. Drain Pan\",Submital!F14=\"Hot Gas - Reverse Cycle - H.G. Drain Pain\",Submital!F14=\"Thermobank\"),OR(Submital!I14=\"15\",Submital!I14=\"10\",Submital!I14=\"0\",Submital!I14=\"-10\",Submital!I14=\"-20\",Submital!I14=\"-30\",Submital!I14=\"-40\")),\"High-Static Fan Blades\",\"\")","v":""}]
[null,null,"Heat Exchanger HX-25 - Loose"]
[null,null,"Heat Exchanger HX-50 - Loose"]
[null,null,"Heat Exchanger HX-75 - Loose"]
[null,null,"Heat Exchanger HX-100 - Loose"]
[null,null,"Heat Exchanger HX-150 - Loose"]
[null,null,"Heat Exchanger HX-250 - Loose"]
[null,null,"Heat Exchanger HX-350 - Loose"]

{"sheet":"Pics","index":5,"n_rows":22,"n_cols":5,"rows_kept":22,"cut":false,"hidden":true,"merged":[]}
[]
[]
[]
[null,null,1]
[null,null,2]
[null,null,3]
[null,null,4]
[]
[]
[]
[]
[]
[]
[]
[]
[]
[]
[]
[null,null,null,null,"Russell"]
[null,null,null,null,"Witt"]
[null,null,null,null,"Kramer"]
[null,null,null,null,"ColdZone"]