{"text_format":"1","workbook":"xlsx","n_sheets":6,"sheets":["Submital","Sheet1","REVISION","SUBMITTAL DATA","All Temp Options","Pics"],"not_rendered":{"charts":0,"images":19,"macros":1,"external_links":0,"defined_names":20,"comments":0,"pivot_tables":0},"unopened":[],"bounds":{"document_bytes":16777216,"sheet_cells":100000,"rows_first":2000,"rows_last":500,"rows_between":2000,"halvings":0,"cell_chars":16384,"cell_head_chars":4096},"cells_cut":0,"cells_raw":0,"read":"whole","date_system":"1900"}

{"sheet":"Submital","index":0,"n_rows":100,"n_cols":37,"rows_kept":100,"cut":false,"hidden":false,"merged":[[41,33,41,34],[41,35,41,36],[71,16,71,17],[5,11,5,13],[5,0,5,7],[6,0,6,4],[7,0,7,4],[8,0,8,4],[6,11,6,13],[7,11,7,13],[8,11,8,13],[6,5,6,7],[7,5,7,7],[6,8,6,10],[7,8,7,10],[8,8,8,10],[8,5,8,7],[14,0,14,13],[10,5,10,7],[13,12,13,13],[12,5,12,7],[13,5,13,7],[9,11,9,13],[9,5,9,7],[10,11,10,13],[10,8,10,10],[12,10,12,11],[13,10,13,11],[9,8,9,10],[13,2,13,3],[11,0,11,13],[12,0,12,1],[12,12,12,13],[13,0,13,1],[4,6,4,10],[4,12,4,13],[0,0,4,5],[0,6,0,10],[0,11,0,13],[1,6,1,10],[1,11,1,13],[2,6,2,10],[2,11,2,13],[3,6,3,10],[3,12,3,13],[5,8,5,10],[9,0,9,4],[10,0,10,4],[15,0,29,13],[31,0,32,1],[33,0,33,1],[31,7,32,7],[31,6,32,6],[31,2,32,2],[31,8,32,8],[31,3,31,5],[31,9,32,9],[31,10,32,10],[31,11,32,11],[30,2,30,11],[12,2,12,3],[50,0,50,1],[39,0,39,13],[37,0,37,1],[35,0,36,1],[35,9,36,9],[35,10,36,10],[43,0,43,13],[40,8,40,13],[41,8,41,13],[42,8,42,13],[40,6,42,7],[40,0,40,5],[41,0,41,5],[42,0,42,5],[35,11,36,11],[34,0,34,11],[35,13,36,13],[49,0,49,1],[35,2,36,3],[37,2,37,3],[35,8,36,8],[35,12,36,12],[35,6,36,7],[37,6,37,7],[35,4,36,4],[35,5,36,5],[38,0,38,13],[48,0,48,8],[44,0,44,13],[45,0,47,13]]}
[null,null,null,null,null,null,"HEAT TRANSFER PRODUCTS GROUP, LLC",null,null,null,null,"SUBMITTAL DATA SHEET"]
[null,null,null,null,null,null,"3885 Crestwood Parkway / Suite 500",null,null,null,null,"WAREHOUSE",null,null,null,null,null,"HIGH STATIC",true]
[null,null,null,null,null,null,"Duluth, GA  30096",null,null,null,null,"UNIT COOLER"]
[null,null,null,null,null,null,"(P) 800-288-9488 / (F) 256-259-7478",null,null,null,null,null,"For Record Only",null,null,null,null,null,null,"T5 IS TEST FOR HIGH STATIC BECAUSE I WAS HAVING TROUBLE WITH DROP LIST SELECTION BEING STATIC AND CHANGING OPTOIN AND GETTING A FALSE VALID SELECTION"]
[null,null,null,null,null,null,"https://www.htpg.com/",null,null,null,null,null,"For Approval",null,null,null,null,null,null,{"$f":"IF(AND(T96>=1,'All Temp Options'!C21=\"\"),FALSE,TRUE)","v":true}]
[{"$f":"\"Rev. \"","v":"Rev. "},null,null,null,null,null,null,null,null,null,null,null,null,null,null,null,null,null,null,{"$f":"IF(T5=FALSE,FALSE,IF(T96=0,\"T\",\"H\"))","v":"T"}]
["Job Name:",null,null,null,null,null,null,null,"Job Location:"]
["Customer Name:"]
["Architect / Engineer:",null,null,null,null,null,null,null,"Prepared By:"]
["Unit Model Number:",null,null,null,null,{"$f":"IFERROR(R41,\"\")","v":""},null,null,"Tagging Info:"]
["Unit Quantity:",null,null,null,null,null,null,null,"Date:",null,null,{"$f":"TODAY()","v":"2024-09-20"}]
["Select unit attributes from the application option above and the drop down menus below to build required model number"]
["Brand",null,"Motor Type",null,"FPI","Defrost Type",null,null,"SST","Refrig.",{"$f":"\"R-\"&J14&\" Adjusted Capacity (BTUH) @ 10F TD\"","v":"R-448A Adjusted Capacity (BTUH) @ 10F TD"},null,"Unit Voltage"]
["Witt",null,"3-Ph Std Motor",null,6,"Electric- Low Temperature",null,null,"25","448A",282500,null,"208-230/3/60"]
["**clear all  fields when starting over**",null,null,null,null,null,null,null,null,null,null,null,null,null,null,null,"Russell","R","3-Ph Std Motor","T",null,null,null,{"$f":"IF(OR(E14=\"\",E14=6),\"Air\",\"\")","v":"Air"},"A",4,null,"404A","A",null,"208-230/3/60","E"]
[null,null,null,null,null,null,null,null,null,null,null,null,null,null,null,null,"Witt","W","3-Ph High Static","H",null,null,null,{"$f":"IF(C14=\"3-Ph Std Motor\",\"Electric- Medium Temperature\",\"\")","v":"Electric- Medium Temperature"},"D",6,null,"407A","E",null,"460/3/60","G"]
[null,null,null,null,null,null,null,null,null,null,null,null,null,null,null,null,"Kramer","K",null,null,null,null,null,"Electric- Low Temperature","E",null,null,"448A","E",null,"575/3/60","J"]
[null,null,null,null,null,null,null,null,null,null,null,null,null,null,null,null,"ColdZone","C",null,null,null,null,null,"Hot Gas - 3 Pipe - Elec. Drain Pan","H",null,null,"449A","E"]
[null,null,null,null,null,null,null,null,null,null,null,null,null,null,null,null,null,null,null,null,null,null,null,"Hot Gas - 3 Pipe - H.G. Drain Pain","K",null,null,"449B","E"]
[null,null,null,null,null,null,null,null,null,null,null,null,null,null,null,null,null,null,null,null,null,null,null,"Hot Gas - Reverse Cycle - Elec. Drain Pan","G"]
[null,null,null,null,null,null,null,null,null,null,null,null,null,null,null,null,null,null,null,null,null,null,null,"Hot Gas - Reverse Cycle - H.G. Drain Pain","L"]
[null,null,null,null,null,null,null,null,null,null,null,null,null,null,null,null,null,null,null,null,null,null,null,{"$f":"IF(A14=\"KRAMER\",\"Thermobank\",\"\")","v":""},"T"]
[null,null,null,null,null,null,null,null,null,null,null,null,null,null,null,null,null,null,null,null,null,null,null,{"$f":"IF(A14=\"KRAMER\",\"Thermobank-Medium Temperature\",\"\")","v":""},"S"]
[null,null,null,null,null,null,null,null,null,null,null,null,null,null,null,null,null,null,null,null,null,null,null,"Hot Gas - 3 Pipe - Elec. Drain Pan MT","B"]
[null,null,null,null,null,null,null,null,null,null,null,null,null,null,null,null,null,null,null,null,null,null,null,"Hot Gas - 3 Pipe - H.G. Drain Pain MT","C"]
[null,null,null,null,null,null,null,null,null,null,null,null,null,null,null,null,null,null,null,null,null,null,null,"Hot Gas - Reverse Cycle - Elec. Drain Pan MT","M"]
[null,null,null,null,null,null,null,null,null,null,null,null,null,null,null,null,null,null,null,null,null,null,null,"Hot Gas - Reverse Cycle - H.G. Drain Pain MT","N",null,null,"shows 744 in list","No"]
[]
[]
[]
[null,null,"Physical Data"]
["Base Model",null,"Fins/Inch","Refrig. Conn (ODS)",null,null,"Net Weight","Ship Weight ","Number of Fans","Air Throw","CFM","Fan Diameter"]
[null,null,null,"Liquid","Suction","Hot Gas"]
[{"$f":"IFERROR(\"W\"&E14&S38&T38,\"\")","v":""},null,{"$f":"IF(E14=0,\"\",E14)","v":6},{"$f":"IFERROR(VLOOKUP(S41,'SUBMITTAL DATA'!A2:AE1000,21,FALSE),\"\")","v":""},{"$f":"IFERROR(VLOOKUP(S41,'SUBMITTAL DATA'!A2:AE1000,22,FALSE),\"\")","v":""},{"$f":"IFERROR(VLOOKUP(S41,'SUBMITTAL DATA'!A2:AE1000,23,FALSE),\"\")","v":""},{"$f":"IFERROR(VLOOKUP(S41,'SUBMITTAL DATA'!A2:AE1000,28,FALSE),\"\")","v":""},{"$f":"IFERROR(VLOOKUP(S41,'SUBMITTAL DATA'!A2:AE1000,29,FALSE),\"\")","v":""},{"$f":"IFERROR(VLOOKUP(S41,'SUBMITTAL DATA'!A2:AE1000,5,FALSE),\"\")","v":""},{"$f":"IF(F10=\"\",\"\",\"120'\")","v":""},{"$f":"IFERROR(VLOOKUP(S41,'SUBMITTAL DATA'!A2:AE1000,13,FALSE),\"\")","v":""},{"$f":"IF(F10=\"\",\"\",\"30\"\"\")","v":""}]
["Electrical Data"]
["Motor Voltage",null,"Total Motor Amps",null,{"$f":"IF(Q68>=1,\"EcoNet MCA\",\"Motor Circuit MCA\")","v":"Motor Circuit MCA"},{"$f":"IF(Q68>=1,\"EcoNet MOPD\",\"Motor Circuit MOPD\")","v":"Motor Circuit MOPD"},"Heater Voltage",null,"Number of Heater Circuits","Heater Amps Each Circuit","Total Heater Amps","Heater Watts"]
[null,null,null,null,null,null,null,null,null,null,null,null,null,null,null,null,"Brand",{"$f":"Submital!A14","v":"Witt"},"Defrost","Capacity",null,"Voltage","Motor","Refrigerant"]
[{"$f":"IFERROR(VLOOKUP(S41,'SUBMITTAL DATA'!A2:AE1000,14,FALSE),\"\")","v":""},null,{"$f":"IFERROR(VLOOKUP(S41,'SUBMITTAL DATA'!A2:AE1000,15,FALSE),\"\")","v":""},null,{"$f":"IFERROR(VLOOKUP(S41,'SUBMITTAL DATA'!A2:AE1000,IF(Q68>=1,26,24),FALSE),\"\")","v":""},{"$f":"IFERROR(VLOOKUP(S41,'SUBMITTAL DATA'!A2:AE1000,IF(Q68>=1,27,25),FALSE),\"\")","v":""},{"$f":"IFERROR(VLOOKUP(S41,'SUBMITTAL DATA'!A2:AE1000,16,FALSE),\"\")","v":""},null,{"$f":"IFERROR(VLOOKUP(S41,'SUBMITTAL DATA'!A2:AE1000,17,FALSE),\"\")","v":""},{"$f":"IFERROR(VLOOKUP(S41,'SUBMITTAL DATA'!A2:AE1000,18,FALSE),\"\")","v":""},{"$f":"IFERROR(VLOOKUP(S41,'SUBMITTAL DATA'!A2:AE1000,19,FALSE),\"\")","v":""},{"$f":"IFERROR(VLOOKUP(S41,'SUBMITTAL DATA'!A2:AE1000,20,FALSE),\"\")","v":""},null,null,null,null," ",{"$f":"VLOOKUP(R37,Q15:R18,2,FALSE)","v":"W"},{"$f":"VLOOKUP(F14,X15:Y22,2,FALSE)","v":"E"},{"$f":"IF(T39<100000,\"0\"&LEFT(T39,LEN(T39)-3),LEFT(T39,LEN(T39)-3))","v":{"$error":"#N/A"}},null,{"$f":"VLOOKUP(M14,AE15:AF17,2,FALSE)","v":"E"},{"$f":"VLOOKUP(C14,S15:T16,2,FALSE)","v":"T"},{"$f":"VLOOKUP($J$14,AB15:AC19,2,FALSE)","v":"E"}]
["APPLICATION NOTE: WAREHOUSE UNIT COOLERS ARE DESIGNED EXCLUSIVELY FOR APLLICATIONS 3,000 SQUARE FEET AND LARGER.",null,null,null,null,null,null,null,null,null,null,null,null,null,null,null,null,null,null,{"$f":"R60","v":{"$error":"#N/A"}}]
["Options (Select catalog options from drop down menu.)",null,null,null,null,null,null,null,null,null,null,null,null,null,null,null,null,"Unit Model Num.","Lookup",null,null,null,null,"Temperature"]
[null,null,null,null,null,null,{"$f":"IF(U68=1,\"CONFIGURATION CONFLICT\",\"\")","v":""},null,null,null,null,null,null,null,null,null,null,{"$f":"R38&\"W\"&E14&S38&T38&V38&W38&\"A\"","v":{"$error":"#N/A"}},{"$f":"\"W\"&E14&S38&T38&V38&W38&\"A\"","v":{"$error":"#N/A"}},null,null,null,null,{"$f":"VLOOKUP(S41,'SUBMITTAL DATA'!A2:AE501,9,FALSE)","v":{"$error":"#N/A"}}]
[null,null,null,null,null,null,null,null,null,null,null,null,null,null,null,null,"HG CAP TABLE IF SELECTED","404a CAP TABLE",null,"404 / 744",null,null,null,null,null,null,"HG refrigerants",null,null,null,null,null,null,"404/744",null,"HG"]
[null,null,null,null,null,null,null,null,null,null,null,null,null,null,null,null,null,null,null,"L4E","L6E","M6A","L4P","L6P","L4R","L6R","4E","6E","6A","4P","6P","4R","6R","M6E","M4E","M6E","M4E"]
[null,null,null,null,null,null,null,null,null,null,null,null,null,null,null,1,{"$f":"ROUND((VLOOKUP(P44,$S$44:$AK$59,$R$100,FALSE)*100)*IF($U$92=1,VLOOKUP($I$14,$X$68:$Y$76,2,FALSE),1),0)","v":41900},{"$f":"VLOOKUP(P44,$S$44:$AK$59,$U$82,FALSE)*100","v":36400},1,383,364,345,383,364,383,364,436,419,404,436,419,436,419,335,290,305,358]
["Additional Requirements",null,null,null,null,null,null,null,null,null,null,null,null,null,null,2,{"$f":"ROUND((VLOOKUP(P45,$S$44:$AK$59,$R$100,FALSE)*100)*IF($U$92=1,VLOOKUP($I$14,$X$68:$Y$76,2,FALSE),1),0)","v":54600},{"$f":"VLOOKUP(P45,$S$44:$AK$59,$U$82,FALSE)*100","v":47900},2,489,479,470,489,479,489,479,560,546,550,560,546,560,546,460,416,550,487]
[null,null,null,null,null,null,null,null,null,null,null,null,null,null,null,3,67900,59200,3,773,592,582,773,592,773,592,886,679,689,886,679,886,679,570,515,689,610]
[null,null,null,null,null,null,null,null,null,null,null,null,null,null,null,4,83500,72500,4,970,725,696,970,725,970,725,1110,835,809,1110,835,1110,835,680,616,809,716]
[null,null,null,null,null,null,null,null,null,null,null,null,null,null,null,5,109400,96100,5,1156,961,945,1156,961,1156,961,1312,1094,1115,1312,1094,1312,1094,930,826,1115,987]
["Capacity Correction for Electric & Hot Gas Defrost Evaporators",null,null,null,null,null,null,null,null,null,null,null,null,null,null,6,137200,120000,6,1457,1200,1172,1457,1200,1457,1200,1664,1372,1388,1664,1372,1664,1372,1160,1037,1388,1228]
["S.S.T. (Dew)",null,"25°F","20°F","0°F","-10°F","-20°F","-30°F","-40°F",null,null,null,null,null,null,7,163100,143600,7,1822,1436,1431,1822,1436,1822,1436,2065,1631,1670,2065,1631,2065,1631,1420,1266,1670,1488]
["Multiply Capacity by:",null,1.16875,1.1499999999999999,1.075,1.0375000000000001,1,0.96250000000000002,0.92500000000000004,null,null,null,null,null,null,8,206600,179500,8,null,1795,"1760",null,1795,null,1795,null,"2066","2075",null,"2066",null,"2066","1750","1558","2075","1836"]
[null,null,null,null,null,null,null,null,null,null,null,null,null,null,null,9,246100,216200,9,null,2162,"1901",null,2162,null,2162,null,"2461","2261",null,"2461",null,"2461","1890","1682","2261","2001"]
[null,null,null,null,null,null,null,null,null,null,null,null,null,null,null,10,0,{"$f":"VLOOKUP(P53,$S$44:$AK$59,$U$82,FALSE)*100","v":0},10,null,null,"2349",null,null,null,null,null,null,"2825",null,null,null,null,"2330","2069","2825","2500"]
[null,null,null,null,null,null,null,null,null,null,null,null,null,null,null,11,0,0,11]
[null,null,null,null,null,null,null,null,null,null,null,null,null,null,null,12,0,0,12]
[null,null,null,null,null,null,null,null,null,null,null,null,null,null,null,13,0,0,13]
[null,null,null,null,null,null,null,null,null,null,null,null,null,null,null,14,0,0,14]
[null,null,null,null,null,null,null,null,null,null,null,null,null,null,null,15,0,0,15]
[null,null,null,null,null,null,null,null,null,null,null,null,null,null,null,16,0,0,16]
[null,null,null,null,null,null,null,null,null,null,null,null,null,null,null,null,null,{"$f":"VLOOKUP(K14,$Q$44:$R$59,2,FALSE)","v":{"$error":"#N/A"}}]
[null,null,null,null,null,null,null,null,null,null,null,null,null,null,null,null,null,null,1,2,3,4,5,6,7,8,9,10,11,12,13,14,15,16,17,18,19]
[]
[]
[]
[]
[null,null,null,null,null,null,null,null,null,null,null,null,null,null,null,null,null,null,null,null,null,null,null,null,{"$f":"IF(AND(OR(F14=X19,F14=X20,F14=X21,F14=\"Air\"),OR(J14=#REF!,J14=AB16,J14=AB17,J14=AB18,J14=AB19)),AB15)","v":{"$error":"#REF!"}}]
[null,null,null,null,null,null,null,null,null,null,null,null,null,null,null,null,"FOR ECONET ELECTRICAL",null,null,"FOR SHEET ERRORS",null,null,{"$f":"IF(OR($S$38=\"E\",$S$38=\"H\",$S$38=\"K\",$S$38=\"G\",$S$38=\"L\",$S$38=\"T\"),\"\",X67)","v":""},"35",1.0409090000000001,null," "]
[null,null,null,null,null,null,null,null,null,null,null,null,null,null,null,null,{"$f":"SUM(Q69:R71)","v":0},null,null,{"$f":"SUM(T69:U71)","v":0},{"$f":"IF(AND(Q68>0,T68>0),1,0)","v":0},null,{"$f":"IF(OR($S$38=\"E\",$S$38=\"H\",$S$38=\"K\",$S$38=\"G\",$S$38=\"L\",$S$38=\"T\"),\"\",X68)","v":""},"25",1,null," "]
[null,null,null,null,null,null,null,null,null,null,null,null,null,null,null,null,{"$f":"IF(A41=\"EcoNet\",1,0)","v":0},{"$f":"IF(I41=\"EcoNet\",1,0)","v":0},null,{"$f":"IF(A41=\"Thermostatic Expansion Valve - Mounted\",1,IF(A41=\"Electronic Expansion Valve - Mounted\",1,IF(A41=\"Liquid Line Solenoid Valve - Mounted\",1,IF(A41=\"Mechanical Thermostat - Mounted\",1,IF(A41=\"Electronic Room Thermostat - Mounted\",1,0)))))","v":0},{"$f":"IF(I41=\"Thermostatic Expansion Valve - Mounted\",1,IF(I41=\"Electronic Expansion Valve - Mounted\",1,IF(I41=\"Liquid Line Solenoid Valve - Mounted\",1,IF(I41=\"Mechanical Thermostat - Mounted\",1,IF(I41=\"Electronic Room Thermostat - Mounted\",1,0)))))","v":0},null,{"$f":"IF(OR($S$38=\"E\",$S$38=\"H\",$S$38=\"K\",$S$38=\"G\",$S$38=\"L\",$S$38=\"T\",$S$38=\"A\"),\"\",X69)","v":""},"20",0.98181799999999997]
[null,null,null,null,null,null,null,null,null,null,null,null,null,null,null,null,{"$f":"IF(A42=\"EcoNet\",1,0)","v":0},{"$f":"IF(C42=\"EcoNet\",1,0)","v":0},null,{"$f":"IF(A42=\"Thermostatic Expansion Valve - Mounted\",1,IF(A42=\"Electronic Expansion Valve - Mounted\",1,IF(A42=\"Liquid Line Solenoid Valve - Mounted\",1,IF(A42=\"Mechanical Thermostat - Mounted\",1,IF(A42=\"Electronic Room Thermostat - Mounted\",1,0)))))","v":0},{"$f":"IF(I42=\"Thermostatic Expansion Valve - Mounted\",1,IF(I42=\"Electronic Expansion Valve - Mounted\",1,IF(I42=\"Liquid Line Solenoid Valve - Mounted\",1,IF(I42=\"Mechanical Thermostat - Mounted\",1,IF(I42=\"Electronic Room Thermostat - Mounted\",1,0)))))","v":0},null,{"$f":"IF(OR($S$38=\"E\",$S$38=\"H\",$S$38=\"K\",$S$38=\"G\",$S$38=\"L\",$S$38=\"T\",$S$38=\"A\"),\"\",X70)","v":""},"15",1.13124]
[null,null,null,null,null,null,null,null,null,null,null,null,null,null,null,null,{"$f":"IF(A43=\"EcoNet\",1,0)","v":0},{"$f":"IF(C43=\"EcoNet\",1,0)","v":0},null,{"$f":"IF(A43=\"Thermostatic Expansion Valve - Mounted\",1,IF(A43=\"Electronic Expansion Valve - Mounted\",1,IF(A43=\"Liquid Line Solenoid Valve - Mounted\",1,IF(A43=\"Mechanical Thermostat - Mounted\",1,IF(A43=\"Electronic Room Thermostat - Mounted\",1,0)))))","v":0},{"$f":"IF(I43=\"Thermostatic Expansion Valve - Mounted\",1,IF(I43=\"Electronic Expansion Valve - Mounted\",1,IF(I43=\"Liquid Line Solenoid Valve - Mounted\",1,IF(I43=\"Mechanical Thermostat - Mounted\",1,IF(I43=\"Electronic Room Thermostat - Mounted\",1,0)))))","v":0},null,{"$f":"IF(OR($S$38=\"E\",$S$38=\"H\",$S$38=\"K\",$S$38=\"G\",$S$38=\"L\",$S$38=\"T\",$S$38=\"A\"),\"\",X71)","v":""},"10",1.1125]
[null,null,null,null,null,null,null,null,null,null,null,null,null,null,null,null,"TELLS CAP TABLE WHICH COLUMN TO LOOK ON",null,null,"TELLS CAP TABLE WHICH COLUMN TO LOOK ON",null,null,{"$f":"IF(OR($S$38=\"A\",$S$38=\"D\",$S$38=\"S\",$S$38=\"B\",$S$38=\"C\",$S$38=\"M\",$S$38=\"N\"),\"\",X72)","v":"0"},"0",1.075]
[null,null,null,null,null,null,null,null,null,null,null,null,null,null,null,null,{"$f":"4&IF(F14=\"Hot Gas - 3 Pipe - Elec. Drain Pan\",\"Hot Gas - 3 Pipe - Elec. Drain Pan\",IF(F14=\"Hot Gas - 3 Pipe - H.G. Drain Pain\",\"Hot Gas - 3 Pipe - H.G. Drain Pain\",\"\"))&\"404A\"","v":"4404A"},5,null,{"$f":"4&IF(F14=\"Hot Gas - 3 Pipe - Elec. Drain Pan\",\"Hot Gas - 3 Pipe - Elec. Drain Pan\",IF(F14=\"Hot Gas - 3 Pipe - H.G. Drain Pain\",\"Hot Gas - 3 Pipe - H.G. Drain Pain\",\"\"))&\"404A\"","v":"4404A"},5,null,{"$f":"IF(OR($S$38=\"A\",$S$38=\"D\",$S$38=\"S\",$S$38=\"B\",$S$38=\"C\",$S$38=\"M\",$S$38=\"N\"),\"\",X73)","v":"-10"},"-10",1.0375000000000001]
[null,null,null,null,null,null,null,null,null,null,null,null,null,null,null,null,{"$f":"6&IF(F14=\"Hot Gas - 3 Pipe - Elec. Drain Pan\",\"Hot Gas - 3 Pipe - Elec. Drain Pan\",IF(F14=\"Hot Gas - 3 Pipe - H.G. Drain Pain\",\"Hot Gas - 3 Pipe - H.G. Drain Pain\",\"\"))&\"404A\"","v":"6404A"},6,null,{"$f":"6&IF(F14=\"Hot Gas - 3 Pipe - Elec. Drain Pan\",\"Hot Gas - 3 Pipe - Elec. Drain Pan\",IF(F14=\"Hot Gas - 3 Pipe - H.G. Drain Pain\",\"Hot Gas - 3 Pipe - H.G. Drain Pain\",\"\"))&\"404A\"","v":"6404A"},6,null,"-20","-20",1]
[null,null,null,null,null,null,null,null,null,null,null,null,null,null,null,null,{"$f":"\"4Electric- Low Temperature\"&\"404A\"","v":"4Electric- Low Temperature404A"},2,null,{"$f":"\"4Electric- Low Temperature\"&\"404A\"","v":"4Electric- Low Temperature404A"},2,null,"-30","-30",0.96250000000000002]
[null,null,null,null,null,null,null,null,null,null,null,null,null,null,null,null,{"$f":"\"6Electric- Low Temperature\"&\"404A\"","v":"6Electric- Low Temperature404A"},3,null,{"$f":"\"6Electric- Low Temperature\"&\"404A\"","v":"6Electric- Low Temperature404A"},3,null,"-40","-40",0.92500000000000004]
[null,null,null,null,null,null,null,null,null,null,null,null,null,null,null,null,{"$f":"\"6Electric- Medium Temperature\"&\"404A\"","v":"6Electric- Medium Temperature404A"},16,null,{"$f":"\"6Electric- Medium Temperature\"&\"404A\"","v":"6Electric- Medium Temperature404A"},16]
[null,null,null,null,null,null,null,null,null,null,null,null,null,null,null,null,{"$f":"\"4Electric- Medium Temperature\"&\"404A\"","v":"4Electric- Medium Temperature404A"},17,null,{"$f":"\"4Electric- Medium Temperature\"&\"404A\"","v":"4Electric- Medium Temperature404A"},17]
[null,null,null,null,null,null,null,null,null,null,null,null,null,null,null,null,{"$f":"\"6Air\"&\"404A\"","v":"6Air404A"},4,null,{"$f":"\"6Air\"&L14&\"404A\"","v":"6Air404A"},4]
[null,null,null,null,null,null,null,null,null,null,null,null,null,null,null,null,{"$f":"4&IF(F14=\"Hot Gas - Reverse Cycle - Elec. Drain Pan\",\"Hot Gas - Reverse Cycle - Elec. Drain Pan\",IF(F14=\"Hot Gas - Reverse Cycle - H.G. Drain Pain\",\"Hot Gas - Reverse Cycle - H.G. Drain Pain\",IF(F14=\"Thermobank\",\"Thermobank\",\"\")))&\"404A\"","v":"4404A"},7,null,{"$f":"4&IF(F14=\"Hot Gas - Reverse Cycle - Elec. Drain Pan\",\"Hot Gas - Reverse Cycle - Elec. Drain Pan\",IF(F14=\"Hot Gas - Reverse Cycle - H.G. Drain Pain\",\"Hot Gas - Reverse Cycle - H.G. Drain Pain\",IF(F14=\"Thermobank\",\"Thermobank\",\"\")))&\"404A\"","v":"4404A"},7]
[null,null,null,null,null,null,null,null,null,null,null,null,null,null,null,null,{"$f":"6&IF(F14=\"Hot Gas - Reverse Cycle - Elec. Drain Pan\",\"Hot Gas - Reverse Cycle - Elec. Drain Pan\",IF(F14=\"Hot Gas - Reverse Cycle - H.G. Drain Pain\",\"Hot Gas - Reverse Cycle - H.G. Drain Pain\",IF(F14=\"Thermobank\",\"Thermobank\",\"\")))&\"404A\"","v":"6404A"},8,null,{"$f":"6&IF(F14=\"Hot Gas - Reverse Cycle - Elec. Drain Pan\",\"Hot Gas - Reverse Cycle - Elec. Drain Pan\",IF(F14=\"Hot Gas - Reverse Cycle - H.G. Drain Pain\",\"Hot Gas - Reverse Cycle - H.G. Drain Pain\",IF(F14=\"Thermobank\",\"Thermobank\",\"\")))&\"404A\"","v":"6404A"},8]
[null,null,null,null,null,null,null,null,null,null,null,null,null,null,null,null,{"$f":"4&IF(F14=\"Hot Gas - 3 Pipe - Elec. Drain Pan\",\"Hot Gas - 3 Pipe - Elec. Drain Pan\",IF(F14=\"Hot Gas - 3 Pipe - H.G. Drain Pain\",\"Hot Gas - 3 Pipe - H.G. Drain Pain\",\"\"))&\"774\"","v":"4774"},5,null,null,{"$f":"VLOOKUP(E14&F14&\"404A\",T73:U81,2,FALSE)","v":3}]
[null,null,null,null,null,null,null,null,null,null,null,null,null,null,null,null,{"$f":"6&IF(F14=\"Hot Gas - 3 Pipe - Elec. Drain Pan\",\"Hot Gas - 3 Pipe - Elec. Drain Pan\",IF(F14=\"Hot Gas - 3 Pipe - H.G. Drain Pain\",\"Hot Gas - 3 Pipe - H.G. Drain Pain\",\"\"))&\"774\"","v":"6774"},6]
[null,null,null,null,null,null,null,null,null,null,null,null,null,null,null,null,{"$f":"\"4Electric- Low Temperature\"&\"774\"","v":"4Electric- Low Temperature774"},2]
[null,null,null,null,null,null,null,null,null,null,null,null,null,null,null,null,{"$f":"\"6Electric- Low Temperature\"&\"774\"","v":"6Electric- Low Temperature774"},3,null,"Thermobank",{"$f":"IF($F$14=T85,1,0)","v":0}]
[null,null,null,null,null,null,null,null,null,null,null,null,null,null,null,null,{"$f":"\"6Electric- Medium Temperature\"&\"774\"","v":"6Electric- Medium Temperature774"},16,null,"Electric- Low Temperature",{"$f":"IF($F$14=T86,1,0)","v":1}]
[null,null,null,null,null,null,null,null,null,null,null,null,null,null,null,null,{"$f":"\"4Electric- Medium Temperature\"&\"774\"","v":"4Electric- Medium Temperature774"},17,null,"Electric- Medium Temperature",{"$f":"IF($F$14=T87,1,0)","v":0}]
[null,null,null,null,null,null,null,null,null,null,null,null,null,null,null,null,{"$f":"\"6Air\"&\"774\"","v":"6Air774"},4,null,"Hot Gas - 3 Pipe - Elec. Drain Pan",{"$f":"IF($F$14=T88,1,0)","v":0}]
[null,null,null,null,null,null,null,null,null,null,null,null,null,null,null,null,{"$f":"4&IF(F14=\"Hot Gas - Reverse Cycle - Elec. Drain Pan\",\"Hot Gas - Reverse Cycle - Elec. Drain Pan\",IF(F14=\"Hot Gas - Reverse Cycle - H.G. Drain Pain\",\"Hot Gas - Reverse Cycle - H.G. Drain Pain\",IF(F14=\"Thermobank\",\"Thermobank\",\"\")))&\"774\"","v":"4774"},7,null,"Hot Gas - 3 Pipe - H.G. Drain Pain",{"$f":"IF($F$14=T89,1,0)","v":0}]
[null,null,null,null,null,null,null,null,null,null,null,null,null,null,null,null,{"$f":"6&IF(F14=\"Hot Gas - Reverse Cycle - Elec. Drain Pan\",\"Hot Gas - Reverse Cycle - Elec. Drain Pan\",IF(F14=\"Hot Gas - Reverse Cycle - H.G. Drain Pain\",\"Hot Gas - Reverse Cycle - H.G. Drain Pain\",IF(F14=\"Thermobank\",\"Thermobank\",\"\")))&\"774\"","v":"6774"},8,null,"Hot Gas - Reverse Cycle - Elec. Drain Pan",{"$f":"IF($F$14=T90,1,0)","v":0}]
[null,null,null,null,null,null,null,null,null,null,null,null,null,null,null,null,{"$f":"4&IF(F14=\"Hot Gas - 3 Pipe - Elec. Drain Pan\",\"Hot Gas - 3 Pipe - Elec. Drain Pan\",IF(F14=\"Hot Gas - 3 Pipe - H.G. Drain Pain\",\"Hot Gas - 3 Pipe - H.G. Drain Pain\",\"\"))&J14","v":"4448A"},12,null,"Hot Gas - Reverse Cycle - H.G. Drain Pain",0]
[null,null,null,null,null,null,null,null,null,null,null,null,null,null,null,null,{"$f":"6&IF(F14=\"Hot Gas - 3 Pipe - Elec. Drain Pan\",\"Hot Gas - 3 Pipe - Elec. Drain Pan\",IF(F14=\"Hot Gas - 3 Pipe - H.G. Drain Pain\",\"Hot Gas - 3 Pipe - H.G. Drain Pain\",\"\"))&J14","v":"6448A"},13,null,null,{"$f":"SUM(U85:U91)","v":1}]
[null,null,null,null,null,null,null,null,null,null,null,null,null,null,null,null,{"$f":"\"4Electric- Low Temperature\"&J14","v":"4Electric- Low Temperature448A"},9]
[null,null,null,null,null,null,null,null,null,null,null,null,null,null,null,null,{"$f":"\"6Electric- Low Temperature\"&J14","v":"6Electric- Low Temperature448A"},10]
[null,null,null,null,null,null,null,null,null,null,null,null,null,null,null,null,{"$f":"\"6Electric- Medium Temperature\"&J14","v":"6Electric- Medium Temperature448A"},18,null,"FOR HIGH STATIC OPTOIN"]
[null,null,null,null,null,null,null,null,null,null,null,null,null,null,null,null,{"$f":"\"4Electric- Medium Temperature\"&J14","v":"4Electric- Medium Temperature448A"},19,null,{"$f":"SUM(T97:U99)","v":0}]
[null,null,null,null,null,null,null,null,null,null,null,null,null,null,null,null,{"$f":"\"6Air\"&J14","v":"6Air448A"},11,null,{"$f":"IF(A41=\"High-Static Fan Blades\",1,0)","v":0},{"$f":"IF(I41=\"High-Static Fan Blades\",1,0)","v":0}]
[null,null,null,null,null,null,null,null,null,null,null,null,null,null,null,null,{"$f":"4&IF(F14=\"Hot Gas - Reverse Cycle - Elec. Drain Pan\",\"Hot Gas - Reverse Cycle - Elec. Drain Pan\",IF(F14=\"Hot Gas - Reverse Cycle - H.G. Drain Pain\",\"Hot Gas - Reverse Cycle - H.G. Drain Pain\",IF(F14=\"Thermobank\",\"Thermobank\",\"\")))&J14","v":"4448A"},14,null,{"$f":"IF(A42=\"High-Static Fan Blades\",1,0)","v":0},{"$f":"IF(I42=\"High-Static Fan Blades\",1,0)","v":0}]
[null,null,null,null,null,null,null,null,null,null,null,null,null,null,null,null,{"$f":"6&IF(F14=\"Hot Gas - Reverse Cycle - Elec. Drain Pan\",\"Hot Gas - Reverse Cycle - Elec. Drain Pan\",IF(F14=\"Hot Gas - Reverse Cycle - H.G. Drain Pain\",\"Hot Gas - Reverse Cycle - H.G. Drain Pain\",IF(F14=\"Thermobank\",\"Thermobank\",\"\")))&J14","v":"6448A"},15,null,{"$f":"IF(A43=\"High-Static Fan Blades\",1,0)","v":0},{"$f":"IF(I43=\"High-Static Fan Blades\",1,0)","v":0}]
[null,null,null,null,null,null,null,null,null,null,null,null,null,null,null,null,null,{"$f":"VLOOKUP(E14&F14&J14,Q73:R99,2,FALSE)","v":10}]

{"sheet":"Sheet1","index":1,"n_rows":0,"n_cols":0,"rows_kept":0,"cut":false,"hidden":true,"merged":[]}

{"sheet":"REVISION","index":2,"n_rows":10,"n_cols":3,"rows_kept":10,"cut":false,"hidden":true,"merged":[]}
[]
[1,"2020-07-29","INITIAL RELEASE"]
[1.01,"2020-08-25","corrected macro error, added additional notes field"]
[1.02,"2021-04-01","corrected an error with the look up table submittal - T48:U55"]
[1.03,"2023-08-25","Sloped Drain Pan"]
[1.04,"2023-11-28","Medium Temp Electric Defrost"]
[1.05,"2024-01-30","Remove High Static Option from WH Medium Temp Electric Defrost"]
[1.05,"2024-01-30","Add 4FPI to WH Medium Temp Electric Defrost"]
[1.05,"2024-01-30","Adjust Model Numbers for WH Medium Temp Electric Defrost (-1)"]
[1.06,"2024-06-25","Revised medium temp capacity from 207900  to 206900 on the 4FPI RW4D206GTA"]

{"sheet":"SUBMITTAL DATA","index":3,"n_rows":774,"n_cols":31,"rows_kept":774,"cut":false,"hidden":true,"merged":[]}
["LOOKUP","FAN TYPE","MODEL FAMILY","DEFROST TYPE","NUMBER OF FANS","MOTOR TYPE","UNIT VOLTAGE","FPI","SST","R404A CAPACITY","R407A/R448A/R449A CAPACITY",null,"CFM","MOTOR VOLTAGE","TOTAL UNIT FAN MOTOR AMPS","HEATER VOLTAGE","Number of Heater Circuits","HEATER AMPS EACH CIRCUIT","Total Heater Amps","HEATER WATTS","LIQUID LINE SIZE","SUCTION LINE SIZE","3-PIPE HG LINE","MCA - NO-ECONET","MOPD - NO-ECONET","MCA - ECONET","MOPD - ECONET","NET WEIGHT","APPROX. SHIP WEIGHT","AWEF CLR","AWEF FRZR"]
["W4E038EHA","HIGH STATIC","WAREHOUSE","ELECTRIC DEFROST- LOW TEMP",1,"THREE PHASE MOTOR","208-230/3/60",4,-20,38300,43600,"-",7010,"208-230/3/60",6.4,"208-230/3/60",1,14.4,14.4,6000,"1/2","2-1/8","-",15,20,16.399999999999999,20,303,480,"N/A","N/A"]
["W4E038ETA","STANDARD","WAREHOUSE","ELECTRIC DEFROST- LOW TEMP",1,"THREE PHASE MOTOR","208-230/3/60",4,-20,38300,43600,"-",7010,"208-230/3/60",4.0999999999999996,"208-230/3/60",1,14.4,14.4,6000,"1/2","2-1/8","-",15,20,16.399999999999999,20,303,480,"N/A","N/A"]
["W4E038GHA","HIGH STATIC","WAREHOUSE","ELECTRIC DEFROST- LOW TEMP",1,"THREE PHASE MOTOR","460/3/60",4,-20,38300,43600,"-",7010,"460/3/60",3.2,"460/3/60",1,7.5,7.5,6000,"1/2","2-1/8","-",15,20,15,20,303,480,"N/A","N/A"]
["W4E038GTA","STANDARD","WAREHOUSE","ELECTRIC DEFROST- LOW TEMP",1,"THREE PHASE MOTOR","460/3/60",4,-20,38300,43600,"-",7010,"460/3/60",2,"460/3/60",1,7.5,7.5,6000,"1/2","2-1/8","-",15,20,15,20,303,480,"N/A","N/A"]
["W4E038JHA","HIGH STATIC","WAREHOUSE","ELECTRIC DEFROST- LOW TEMP",1,"THREE PHASE MOTOR","575/3/60",4,-20,38300,43600,"-",7010,"575/3/60",3,"575/3/60",1,6,6,6000,"1/2","2-1/8","-",15,20,15,20,303,480,"N/A","N/A"]
["W4E038JTA","STANDARD","WAREHOUSE","ELECTRIC DEFROST- LOW TEMP",1,"THREE PHASE MOTOR","575/3/60",4,-20,38300,43600,"-",7010,"575/3/60",2.5,"575/3/60",1,6,6,6000,"1/2","2-1/8","-",15,20,15,20,303,480,"N/A","N/A"]
["W4E048EHA","HIGH STATIC","WAREHOUSE","ELECTRIC DEFROST- LOW TEMP",1,"THREE PHASE MOTOR","208-230/3/60",4,-20,48900,56000,"-",6875,"208-230/3/60",6.4,"208-230/3/60",1,14.4,14.4,6000,"5/8","2-1/8","-",15,20,16.399999999999999,20,303,480,"N/A","N/A"]
["W4E048ETA","STANDARD","WAREHOUSE","ELECTRIC DEFROST- LOW TEMP",1,"THREE PHASE MOTOR","208-230/3/60",4,-20,48900,56000,"-",6875,"208-230/3/60",4.0999999999999996,"208-230/3/60",1,14.4,14.4,6000,"5/8","2-1/8","-",15,20,16.399999999999999,20,303,480,"N/A","N/A"]
["W4E048GHA","HIGH STATIC","WAREHOUSE","ELECTRIC DEFROST- LOW TEMP",1,"THREE PHASE MOTOR","460/3/60",4,-20,48900,56000,"-",6875,"460/3/60",3.2,"460/3/60",1,7.5,7.5,6000,"5/8","2-1/8","-",15,20,15,20,303,480,"N/A","N/A"]
["W4E048GTA","STANDARD","WAREHOUSE","ELECTRIC DEFROST- LOW TEMP",1,"THREE PHASE MOTOR","460/3/60",4,-20,48900,56000,"-",6875,"460/3/60",2,"460/3/60",1,7.5,7.5,6000,"5/8","2-1/8","-",15,20,15,20,303,480,"N/A","N/A"]
["W4E048JHA","HIGH STATIC","WAREHOUSE","ELECTRIC DEFROST- LOW TEMP",1,"THREE PHASE MOTOR","575/3/60",4,-20,48900,56000,"-",6875,"575/3/60",3,"575/3/60",1,6,6,6000,"5/8","2-1/8","-",15,20,15,20,303,480,"N/A","N/A"]
["W4E048JTA","STANDARD","WAREHOUSE","ELECTRIC DEFROST- LOW TEMP",1,"THREE PHASE MOTOR","575/3/60",4,-20,48900,56000,"-",6875,"575/3/60",2.5,"575/3/60",1,6,6,6000,"5/8","2-1/8","-",15,20,15,20,303,480,"N/A","N/A"]
["W4E077EHA","HIGH STATIC","WAREHOUSE","ELECTRIC DEFROST- LOW TEMP",2,"THREE PHASE MOTOR","208-230/3/60",4,-20,77300,88600,"-",14030,"208-230/3/60",12.8,"208-230/3/60",1,28.9,28.9,12000,"5/8","2-1/8","-",15,20,30.9,35,509,750,"N/A","N/A"]
["W4E077ETA","STANDARD","WAREHOUSE","ELECTRIC DEFROST- LOW TEMP",2,"THREE PHASE MOTOR","208-230/3/60",4,-20,77300,88600,"-",14030,"208-230/3/60",8.1999999999999993,"208-230/3/60",1,28.9,28.9,12000,"5/8","2-1/8","-",15,20,30.9,35,509,750,"N/A","N/A"]
["W4E077GHA","HIGH STATIC","WAREHOUSE","ELECTRIC DEFROST- LOW TEMP",2,"THREE PHASE MOTOR","460/3/60",4,-20,77300,88600,"-",14030,"460/3/60",6.4,"460/3/60",1,15.1,15.1,12000,"5/8","2-1/8","-",15,20,16.100000000000001,20,509,750,"N/A","N/A"]
["W4E077GTA","STANDARD","WAREHOUSE","ELECTRIC DEFROST- LOW TEMP",2,"THREE PHASE MOTOR","460/3/60",4,-20,77300,88600,"-",14030,"460/3/60",4,"460/3/60",1,15.1,15.1,12000,"5/8","2-1/8","-",15,20,16.100000000000001,20,509,750,"N/A","N/A"]
["W4E077JHA","HIGH STATIC","WAREHOUSE","ELECTRIC DEFROST- LOW TEMP",2,"THREE PHASE MOTOR","575/3/60",4,-20,77300,88600,"-",14030,"575/3/60",6,"575/3/60",1,12,12,12000,"5/8","2-1/8","-",15,20,15,20,509,750,"N/A","N/A"]
["W4E077JTA","STANDARD","WAREHOUSE","ELECTRIC DEFROST- LOW TEMP",2,"THREE PHASE MOTOR","575/3/60",4,-20,77300,88600,"-",14030,"575/3/60",5,"575/3/60",1,12,12,12000,"5/8","2-1/8","-",15,20,15,20,509,750,"N/A","N/A"]
["W4E097EHA","HIGH STATIC","WAREHOUSE","ELECTRIC DEFROST- LOW TEMP",2,"THREE PHASE MOTOR","208-230/3/60",4,-20,97000,111000,"-",13750,"208-230/3/60",12.8,"208-230/3/60",1,28.9,28.9,12000,"7/8","3-1/8","-",15,20,30.9,35,509,750,"N/A","N/A"]
["W4E097ETA","STANDARD","WAREHOUSE","ELECTRIC DEFROST- LOW TEMP",2,"THREE PHASE MOTOR","208-230/3/60",4,-20,97000,111000,"-",13750,"208-230/3/60",8.1999999999999993,"208-230/3/60",1,28.9,28.9,12000,"7/8","3-1/8","-",15,20,30.9,35,509,750,"N/A","N/A"]
["W4E097GHA","HIGH STATIC","WAREHOUSE","ELECTRIC DEFROST- LOW TEMP",2,"THREE PHASE MOTOR","460/3/60",4,-20,97000,111000,"-",13750,"460/3/60",6.4,"460/3/60",1,15.1,15.1,12000,"7/8","3-1/8","-",15,20,16.100000000000001,20,509,750,"N/A","N/A"]
["W4E097GTA","STANDARD","WAREHOUSE","ELECTRIC DEFROST- LOW TEMP",2,"THREE PHASE MOTOR","460/3/60",4,-20,97000,111000,"-",13750,"460/3/60",4,"460/3/60",1,15.1,15.1,12000,"7/8","3-1/8","-",15,20,16.100000000000001,20,509,750,"N/A","N/A"]
["W4E097JHA","HIGH STATIC","WAREHOUSE","ELECTRIC DEFROST- LOW TEMP",2,"THREE PHASE MOTOR","575/3/60",4,-20,97000,111000,"-",13750,"575/3/60",6,"575/3/60",1,12,12,12000,"7/8","3-1/8","-",15,20,15,20,509,750,"N/A","N/A"]
["W4E097JTA","STANDARD","WAREHOUSE","ELECTRIC DEFROST- LOW TEMP",2,"THREE PHASE MOTOR","575/3/60",4,-20,97000,111000,"-",13750,"575/3/60",5,"575/3/60",1,12,12,12000,"7/8","3-1/8","-",15,20,15,20,509,750,"N/A","N/A"]
["W4E115EHA","HIGH STATIC","WAREHOUSE","ELECTRIC DEFROST- LOW TEMP",3,"THREE PHASE MOTOR","208-230/3/60",4,-20,115600,131200,"-",21040,"208-230/3/60",19.2,"208-230/3/60",1,43.3,43.3,18000,"7/8","3-1/8","-",20.8,25,45.3,50,682,1030,"N/A","N/A"]
["W4E115ETA","STANDARD","WAREHOUSE","ELECTRIC DEFROST- LOW TEMP",3,"THREE PHASE MOTOR","208-230/3/60",4,-20,115600,131200,"-",21040,"208-230/3/60",12.3,"208-230/3/60",1,43.3,43.3,18000,"7/8","3-1/8","-",15,20,45.3,50,682,1030,"N/A","N/A"]
["W4E115GHA","HIGH STATIC","WAREHOUSE","ELECTRIC DEFROST- LOW TEMP",3,"THREE PHASE MOTOR","460/3/60",4,-20,115600,131200,"-",21040,"460/3/60",9.6,"460/3/60",1,22.6,22.6,18000,"7/8","3-1/8","-",15,20,23.6,25,682,1030,"N/A","N/A"]
["W4E115GTA","STANDARD","WAREHOUSE","ELECTRIC DEFROST- LOW TEMP",3,"THREE PHASE MOTOR","460/3/60",4,-20,115600,131200,"-",21040,"460/3/60",6,"460/3/60",1,22.6,22.6,18000,"7/8","3-1/8","-",15,20,23.6,25,682,1030,"N/A","N/A"]
["W4E115JHA","HIGH STATIC","WAREHOUSE","ELECTRIC DEFROST- LOW TEMP",3,"THREE PHASE MOTOR","575/3/60",4,-20,115600,131200,"-",21040,"575/3/60",9,"575/3/60",1,18.100000000000001,18.100000000000001,18000,"7/8","3-1/8","-",15,20,19.100000000000001,25,682,1030,"N/A","N/A"]
["W4E115JTA","STANDARD","WAREHOUSE","ELECTRIC DEFROST- LOW TEMP",3,"THREE PHASE MOTOR","575/3/60",4,-20,115600,131200,"-",21040,"575/3/60",7.5,"575/3/60",1,18.100000000000001,18.100000000000001,18000,"7/8","3-1/8","-",15,20,19.100000000000001,25,682,1030,"N/A","N/A"]
["W4E145EHA","HIGH STATIC","WAREHOUSE","ELECTRIC DEFROST- LOW TEMP",3,"THREE PHASE MOTOR","208-230/3/60",4,-20,145700,166400,"-",20625,"208-230/3/60",19.2,"208-230/3/60",1,43.3,43.3,18000,"1-1/8","3-1/8","-",20.8,25,45.3,50,682,1030,"N/A","N/A"]
["W4E145ETA","STANDARD","WAREHOUSE","ELECTRIC DEFROST- LOW TEMP",3,"THREE PHASE MOTOR","208-230/3/60",4,-20,145700,166400,"-",20625,"208-230/3/60",12.3,"208-230/3/60",1,43.3,43.3,18000,"1-1/8","3-1/8","-",15,20,45.3,50,682,1030,"N/A","N/A"]
["W4E145GHA","HIGH STATIC","WAREHOUSE","ELECTRIC DEFROST- LOW TEMP",3,"THREE PHASE MOTOR","460/3/60",4,-20,145700,166400,"-",20625,"460/3/60",9.6,"460/3/60",1,22.6,22.6,18000,"1-1/8","3-1/8","-",15,20,23.6,25,682,1030,"N/A","N/A"]
["W4E145GTA","STANDARD","WAREHOUSE","ELECTRIC DEFROST- LOW TEMP",3,"THREE PHASE MOTOR","460/3/60",4,-20,145700,166400,"-",20625,"460/3/60",6,"460/3/60",1,22.6,22.6,18000,"1-1/8","3-1/8","-",15,20,23.6,25,682,1030,"N/A","N/A"]
["W4E145JHA","HIGH STATIC","WAREHOUSE","ELECTRIC DEFROST- LOW TEMP",3,"THREE PHASE MOTOR","575/3/60",4,-20,145700,166400,"-",20625,"575/3/60",9,"575/3/60",1,18.100000000000001,18.100000000000001,18000,"1-1/8","3-1/8","-",15,20,19.100000000000001,25,682,1030,"N/A","N/A"]
["W4E145JTA","STANDARD","WAREHOUSE","ELECTRIC DEFROST- LOW TEMP",3,"THREE PHASE MOTOR","575/3/60",4,-20,145700,166400,"-",20625,"575/3/60",7.5,"575/3/60",1,18.100000000000001,18.100000000000001,18000,"1-1/8","3-1/8","-",15,20,19.100000000000001,25,682,1030,"N/A","N/A"]
["W4E182EHA","HIGH STATIC","WAREHOUSE","ELECTRIC DEFROST- LOW TEMP",4,"THREE PHASE MOTOR","208-230/3/60",4,-20,182200,206500,"-",27500,"208-230/3/60",25.6,"208-230/3/60",2,28.9,57.7,24000,"1-1/8","3-1/8","-",27.2,30,59.7,60,1050,1360,"N/A","N/A"]
["W4E182ETA","STANDARD","WAREHOUSE","ELECTRIC DEFROST- LOW TEMP",4,"THREE PHASE MOTOR","208-230/3/60",4,-20,182200,206500,"-",27500,"208-230/3/60",16.399999999999999,"208-230/3/60",2,28.9,57.7,24000,"1-1/8","3-1/8","-",17.399999999999999,20,59.7,60,1050,1360,"N/A","N/A"]
["W4E182GHA","HIGH STATIC","WAREHOUSE","ELECTRIC DEFROST- LOW TEMP",4,"THREE PHASE MOTOR","460/3/60",4,-20,182200,206500,"-",27500,"460/3/60",12.8,"460/3/60",1,30.1,30.1,24000,"1-1/8","3-1/8","-",15,20,31.1,35,1050,1360,"N/A","N/A"]
["W4E182GTA","STANDARD","WAREHOUSE","ELECTRIC DEFROST- LOW TEMP",4,"THREE PHASE MOTOR","460/3/60",4,-20,182200,206500,"-",27500,"460/3/60",8,"460/3/60",1,30.1,30.1,24000,"1-1/8","3-1/8","-",15,20,31.1,35,1050,1360,"N/A","N/A"]
["W4E182JHA","HIGH STATIC","WAREHOUSE","ELECTRIC DEFROST- LOW TEMP",4,"THREE PHASE MOTOR","575/3/60",4,-20,182200,206500,"-",27500,"575/3/60",12,"575/3/60",1,24.1,24.1,24000,"1-1/8","3-1/8","-",15,20,25.1,30,1050,1360,"N/A","N/A"]
["W4E182JTA","STANDARD","WAREHOUSE","ELECTRIC DEFROST- LOW TEMP",4,"THREE PHASE MOTOR","575/3/60",4,-20,182200,206500,"-",27500,"575/3/60",10,"575/3/60",1,24.1,24.1,24000,"1-1/8","3-1/8","-",15,20,25.1,30,1050,1360,"N/A","N/A"]
["W4G038EHA","HIGH STATIC","WAREHOUSE","HOT GAS - REVERSE CYCLE - ELECTRIC PAN",1,"THREE PHASE MOTOR","208-230/3/60",4,-20,38300,43600,"-",7010,"208-230/3/60",6.4,"208-230/1/60",1,8.3000000000000007,8.3000000000000007,2000,"1/2","2-1/8","-",15,20,"-","-",303,480,"N/A","N/A"]
["W4G038ETA","STANDARD","WAREHOUSE","HOT GAS - REVERSE CYCLE - ELECTRIC PAN",1,"THREE PHASE MOTOR","208-230/3/60",4,-20,38300,43600,"-",7010,"208-230/3/60",4.0999999999999996,"208-230/1/60",1,8.3000000000000007,8.3000000000000007,2000,"1/2","2-1/8","-",15,20,"-","-",303,480,"N/A","N/A"]
["W4G038GHA","HIGH STATIC","WAREHOUSE","HOT GAS - REVERSE CYCLE - ELECTRIC PAN",1,"THREE PHASE MOTOR","460/3/60",4,-20,38300,43600,"-",7010,"460/3/60",3.2,"460/1/60",1,4.3,4.3,2000,"1/2","2-1/8","-",15,20,"-","-",303,480,"N/A","N/A"]
["W4G038GTA","STANDARD","WAREHOUSE","HOT GAS - REVERSE CYCLE - ELECTRIC PAN",1,"THREE PHASE MOTOR","460/3/60",4,-20,38300,43600,"-",7010,"460/3/60",2,"460/1/60",1,4.3,4.3,2000,"1/2","2-1/8","-",15,20,"-","-",303,480,"N/A","N/A"]
["W4G038JHA","HIGH STATIC","WAREHOUSE","HOT GAS - REVERSE CYCLE - ELECTRIC PAN",1,"THREE PHASE MOTOR","575/3/60",4,-20,38300,43600,"-",7010,"575/3/60",3,"575/1/60",1,2,2,2000,"1/2","2-1/8","-",15,20,"-","-",303,480,"N/A","N/A"]
["W4G038JTA","STANDARD","WAREHOUSE","HOT GAS - REVERSE CYCLE - ELECTRIC PAN",1,"THREE PHASE MOTOR","575/3/60",4,-20,38300,43600,"-",7010,"575/3/60",2.5,"575/1/60",1,2,2,2000,"1/2","2-1/8","-",15,20,"-","-",303,480,"N/A","N/A"]
["W4G048EHA","HIGH STATIC","WAREHOUSE","HOT GAS - REVERSE CYCLE - ELECTRIC PAN",1,"THREE PHASE MOTOR","208-230/3/60",4,-20,48900,56000,"-",6875,"208-230/3/60",6.4,"208-230/1/60",1,8.3000000000000007,8.3000000000000007,2000,"5/8","2-1/8","-",15,20,"-","-",303,480,"N/A","N/A"]
["W4G048ETA","STANDARD","WAREHOUSE","HOT GAS - REVERSE CYCLE - ELECTRIC PAN",1,"THREE PHASE MOTOR","208-230/3/60",4,-20,48900,56000,"-",6875,"208-230/3/60",4.0999999999999996,"208-230/1/60",1,8.3000000000000007,8.3000000000000007,2000,"5/8","2-1/8","-",15,20,"-","-",303,480,"N/A","N/A"]
["W4G048GHA","HIGH STATIC","WAREHOUSE","HOT GAS - REVERSE CYCLE - ELECTRIC PAN",1,"THREE PHASE MOTOR","460/3/60",4,-20,48900,56000,"-",6875,"460/3/60",3.2,"460/1/60",1,4.3,4.3,2000,"5/8","2-1/8","-",15,20,"-","-",303,480,"N/A","N/A"]
["W4G048GTA","STANDARD","WAREHOUSE","HOT GAS - REVERSE CYCLE - ELECTRIC PAN",1,"THREE PHASE MOTOR","460/3/60",4,-20,48900,56000,"-",6875,"460/3/60",2,"460/1/60",1,4.3,4.3,2000,"5/8","2-1/8","-",15,20,"-","-",303,480,"N/A","N/A"]
["W4G048JHA","HIGH STATIC","WAREHOUSE","HOT GAS - REVERSE CYCLE - ELECTRIC PAN",1,"THREE PHASE MOTOR","575/3/60",4,-20,48900,56000,"-",6875,"575/3/60",3,"575/1/60",1,2,2,2000,"5/8","2-1/8","-",15,20,"-","-",303,480,"N/A","N/A"]
["W4G048JTA","STANDARD","WAREHOUSE","HOT GAS - REVERSE CYCLE - ELECTRIC PAN",1,"THREE PHASE MOTOR","575/3/60",4,-20,48900,56000,"-",6875,"575/3/60",2.5,"575/1/60",1,2,2,2000,"5/8","2-1/8","-",15,20,"-","-",303,480,"N/A","N/A"]
["W4G077EHA","HIGH STATIC","WAREHOUSE","HOT GAS - REVERSE CYCLE - ELECTRIC PAN",2,"THREE PHASE MOTOR","208-230/3/60",4,-20,77300,88600,"-",14030,"208-230/3/60",12.8,"208-230/1/60",1,16.7,16.7,4000,"5/8","2-1/8","-",15,20,"-","-",509,750,"N/A","N/A"]
["W4G077ETA","STANDARD","WAREHOUSE","HOT GAS - REVERSE CYCLE - ELECTRIC PAN",2,"THREE PHASE MOTOR","208-230/3/60",4,-20,77300,88600,"-",14030,"208-230/3/60",8.1999999999999993,"208-230/1/60",1,16.7,16.7,4000,"5/8","2-1/8","-",15,20,"-","-",509,750,"N/A","N/A"]
["W4G077GHA","HIGH STATIC","WAREHOUSE","HOT GAS - REVERSE CYCLE - ELECTRIC PAN",2,"THREE PHASE MOTOR","460/3/60",4,-20,77300,88600,"-",14030,"460/3/60",6.4,"460/1/60",1,8.6999999999999993,8.6999999999999993,4000,"5/8","2-1/8","-",15,20,"-","-",509,750,"N/A","N/A"]
["W4G077GTA","STANDARD","WAREHOUSE","HOT GAS - REVERSE CYCLE - ELECTRIC PAN",2,"THREE PHASE MOTOR","460/3/60",4,-20,77300,88600,"-",14030,"460/3/60",4,"460/1/60",1,8.6999999999999993,8.6999999999999993,4000,"5/8","2-1/8","-",15,20,"-","-",509,750,"N/A","N/A"]
["W4G077JHA","HIGH STATIC","WAREHOUSE","HOT GAS - REVERSE CYCLE - ELECTRIC PAN",2,"THREE PHASE MOTOR","575/3/60",4,-20,77300,88600,"-",14030,"575/3/60",6,"575/1/60",1,4,4,4000,"5/8","2-1/8","-",15,20,"-","-",509,750,"N/A","N/A"]
["W4G077JTA","STANDARD","WAREHOUSE","HOT GAS - REVERSE CYCLE - ELECTRIC PAN",2,"THREE PHASE MOTOR","575/3/60",4,-20,77300,88600,"-",14030,"575/3/60",5,"575/1/60",1,4,4,4000,"5/8","2-1/8","-",15,20,"-","-",509,750,"N/A","N/A"]
["W4G097EHA","HIGH STATIC","WAREHOUSE","HOT GAS - REVERSE CYCLE - ELECTRIC PAN",2,"THREE PHASE MOTOR","208-230/3/60",4,-20,97000,111000,"-",13750,"208-230/3/60",12.8,"208-230/1/60",1,16.7,16.7,4000,"7/8","3-1/8","-",15,20,"-","-",509,750,"N/A","N/A"]
["W4G097ETA","STANDARD","WAREHOUSE","HOT GAS - REVERSE CYCLE - ELECTRIC PAN",2,"THREE PHASE MOTOR","208-230/3/60",4,-20,97000,111000,"-",13750,"208-230/3/60",8.1999999999999993,"208-230/1/60",1,16.7,16.7,4000,"7/8","3-1/8","-",15,20,"-","-",509,750,"N/A","N/A"]
["W4G097GHA","HIGH STATIC","WAREHOUSE","HOT GAS - REVERSE CYCLE - ELECTRIC PAN",2,"THREE PHASE MOTOR","460/3/60",4,-20,97000,111000,"-",13750,"460/3/60",6.4,"460/1/60",1,8.6999999999999993,8.6999999999999993,4000,"7/8","3-1/8","-",15,20,"-","-",509,750,"N/A","N/A"]
["W4G097GTA","STANDARD","WAREHOUSE","HOT GAS - REVERSE CYCLE - ELECTRIC PAN",2,"THREE PHASE MOTOR","460/3/60",4,-20,97000,111000,"-",13750,"460/3/60",4,"460/1/60",1,8.6999999999999993,8.6999999999999993,4000,"7/8","3-1/8","-",15,20,"-","-",509,750,"N/A","N/A"]
["W4G097JHA","HIGH STATIC","WAREHOUSE","HOT GAS - REVERSE CYCLE - ELECTRIC PAN",2,"THREE PHASE MOTOR","575/3/60",4,-20,97000,111000,"-",13750,"575/3/60",6,"575/1/60",1,4,4,4000,"7/8","3-1/8","-",15,20,"-","-",509,750,"N/A","N/A"]
["W4G097JTA","STANDARD","WAREHOUSE","HOT GAS - REVERSE CYCLE - ELECTRIC PAN",2,"THREE PHASE MOTOR","575/3/60",4,-20,97000,111000,"-",13750,"575/3/60",5,"575/1/60",1,4,4,4000,"7/8","3-1/8","-",15,20,"-","-",509,750,"N/A","N/A"]
["W4G115EHA","HIGH STATIC","WAREHOUSE","HOT GAS - REVERSE CYCLE - ELECTRIC PAN",3,"THREE PHASE MOTOR","208-230/3/60",4,-20,115600,131200,"-",21040,"208-230/3/60",19.2,"208-230/1/60",1,25,25,6000,"7/8","3-1/8","-",20.8,25,"-","-",682,1030,"N/A","N/A"]
["W4G115ETA","STANDARD","WAREHOUSE","HOT GAS - REVERSE CYCLE - ELECTRIC PAN",3,"THREE PHASE MOTOR","208-230/3/60",4,-20,115600,131200,"-",21040,"208-230/3/60",12.3,"208-230/1/60",1,25,25,6000,"7/8","3-1/8","-",15,20,"-","-",682,1030,"N/A","N/A"]
["W4G115GHA","HIGH STATIC","WAREHOUSE","HOT GAS - REVERSE CYCLE - ELECTRIC PAN",3,"THREE PHASE MOTOR","460/3/60",4,-20,115600,131200,"-",21040,"460/3/60",9.6,"460/1/60",1,13,13,6000,"7/8","3-1/8","-",15,20,"-","-",682,1030,"N/A","N/A"]
["W4G115GTA","STANDARD","WAREHOUSE","HOT GAS - REVERSE CYCLE - ELECTRIC PAN",3,"THREE PHASE MOTOR","460/3/60",4,-20,115600,131200,"-",21040,"460/3/60",6,"460/1/60",1,13,13,6000,"7/8","3-1/8","-",15,20,"-","-",682,1030,"N/A","N/A"]
["W4G115JHA","HIGH STATIC","WAREHOUSE","HOT GAS - REVERSE CYCLE - ELECTRIC PAN",3,"THREE PHASE MOTOR","575/3/60",4,-20,115600,131200,"-",21040,"575/3/60",9,"575/1/60",1,6,6,6000,"7/8","3-1/8","-",15,20,"-","-",682,1030,"N/A","N/A"]
["W4G115JTA","STANDARD","WAREHOUSE","HOT GAS - REVERSE CYCLE - ELECTRIC PAN",3,"THREE PHASE MOTOR","575/3/60",4,-20,115600,131200,"-",21040,"575/3/60",7.5,"575/1/60",1,6,6,6000,"7/8","3-1/8","-",15,20,"-","-",682,1030,"N/A","N/A"]
["W4G145EHA","HIGH STATIC","WAREHOUSE","HOT GAS - REVERSE CYCLE - ELECTRIC PAN",3,"THREE PHASE MOTOR","208-230/3/60",4,-20,145700,166400,"-",20625,"208-230/3/60",19.2,"208-230/1/60",1,25,25,6000,"1-1/8","3-1/8","-",20.8,25,"-","-",682,1030,"N/A","N/A"]
["W4G145ETA","STANDARD","WAREHOUSE","HOT GAS - REVERSE CYCLE - ELECTRIC PAN",3,"THREE PHASE MOTOR","208-230/3/60",4,-20,145700,166400,"-",20625,"208-230/3/60",12.3,"208-230/1/60",1,25,25,6000,"1-1/8","3-1/8","-",15,20,"-","-",682,1030,"N/A","N/A"]
["W4G145GHA","HIGH STATIC","WAREHOUSE","HOT GAS - REVERSE CYCLE - ELECTRIC PAN",3,"THREE PHASE MOTOR","460/3/60",4,-20,145700,166400,"-",20625,"460/3/60",9.6,"460/1/60",1,13,13,6000,"1-1/8","3-1/8","-",15,20,"-","-",682,1030,"N/A","N/A"]
["W4G145GTA","STANDARD","WAREHOUSE","HOT GAS - REVERSE CYCLE - ELECTRIC PAN",3,"THREE PHASE MOTOR","460/3/60",4,-20,145700,166400,"-",20625,"460/3/60",6,"460/1/60",1,13,13,6000,"1-1/8","3-1/8","-",15,20,"-","-",682,1030,"N/A","N/A"]
["W4G145JHA","HIGH STATIC","WAREHOUSE","HOT GAS - REVERSE CYCLE - ELECTRIC PAN",3,"THREE PHASE MOTOR","575/3/60",4,-20,145700,166400,"-",20625,"575/3/60",9,"575/1/60",1,6,6,6000,"1-1/8","3-1/8","-",15,20,"-","-",682,1030,"N/A","N/A"]
["W4G145JTA","STANDARD","WAREHOUSE","HOT GAS - REVERSE CYCLE - ELECTRIC PAN",3,"THREE PHASE MOTOR","575/3/60",4,-20,145700,166400,"-",20625,"575/3/60",7.5,"575/1/60",1,6,6,6000,"1-1/8","3-1/8","-",15,20,"-","-",682,1030,"N/A","N/A"]
["W4G182EHA","HIGH STATIC","WAREHOUSE","HOT GAS - REVERSE CYCLE - ELECTRIC PAN",4,"THREE PHASE MOTOR","208-230/3/60",4,-20,182200,206500,"-",27500,"208-230/3/60",25.6,"208-230/1/60",1,33.299999999999997,33.299999999999997,8000,"1-1/8","3-1/8","-",27.2,30,"-","-",1050,1360,"N/A","N/A"]
["W4G182ETA","STANDARD","WAREHOUSE","HOT GAS - REVERSE CYCLE - ELECTRIC PAN",4,"THREE PHASE MOTOR","208-230/3/60",4,-20,182200,206500,"-",27500,"208-230/3/60",16.399999999999999,"208-230/1/60",1,33.299999999999997,33.299999999999997,8000,"1-1/8","3-1/8","-",17.399999999999999,20,"-","-",1050,1360,"N/A","N/A"]
["W4G182GHA","HIGH STATIC","WAREHOUSE","HOT GAS - REVERSE CYCLE - ELECTRIC PAN",4,"THREE PHASE MOTOR","460/3/60",4,-20,182200,206500,"-",27500,"460/3/60",12.8,"460/1/60",1,17.399999999999999,17.399999999999999,8000,"1-1/8","3-1/8","-",15,20,"-","-",1050,1360,"N/A","N/A"]
["W4G182GTA","STANDARD","WAREHOUSE","HOT GAS - REVERSE CYCLE - ELECTRIC PAN",4,"THREE PHASE MOTOR","460/3/60",4,-20,182200,206500,"-",27500,"460/3/60",8,"460/1/60",1,17.399999999999999,17.399999999999999,8000,"1-1/8","3-1/8","-",15,20,"-","-",1050,1360,"N/A","N/A"]
["W4G182JHA","HIGH STATIC","WAREHOUSE","HOT GAS - REVERSE CYCLE - ELECTRIC PAN",4,"THREE PHASE MOTOR","575/3/60",4,-20,182200,206500,"-",27500,"575/3/60",12,"575/1/60",1,8,8,8000,"1-1/8","3-1/8","-",15,20,"-","-",1050,1360,"N/A","N/A"]
["W4G182JTA","STANDARD","WAREHOUSE","HOT GAS - REVERSE CYCLE - ELECTRIC PAN",4,"THREE PHASE MOTOR","575/3/60",4,-20,182200,206500,"-",27500,"575/3/60",10,"575/1/60",1,8,8,8000,"1-1/8","3-1/8","-",15,20,"-","-",1050,1360,"N/A","N/A"]
["W4H038EHA","HIGH STATIC","WAREHOUSE","HOT GAS - 3-PIPE - ELECTRIC PAN",1,"THREE PHASE MOTOR","208-230/3/60",4,-20,38300,43600,"-",7010,"208-230/3/60",6.4,"208-230/1/60",1,8.3000000000000007,8.3000000000000007,2000,"1/2","2-1/8","-",15,20,"-","-",303,480,"N/A","N/A"]
["W4H038ETA","STANDARD","WAREHOUSE","HOT GAS - 3-PIPE - ELECTRIC PAN",1,"THREE PHASE MOTOR","208-230/3/60",4,-20,38300,43600,"-",7010,"208-230/3/60",4.0999999999999996,"208-230/1/60",1,8.3000000000000007,8.3000000000000007,2000,"1/2","2-1/8","-",15,20,"-","-",303,480,"N/A","N/A"]
["W4H038GHA","HIGH STATIC","WAREHOUSE","HOT GAS - 3-PIPE - ELECTRIC PAN",1,"THREE PHASE MOTOR","460/3/60",4,-20,38300,43600,"-",7010,"460/3/60",3.2,"460/1/60",1,4.3,4.3,2000,"1/2","2-1/8","-",15,20,"-","-",303,480,"N/A","N/A"]
["W4H038GTA","STANDARD","WAREHOUSE","HOT GAS - 3-PIPE - ELECTRIC PAN",1,"THREE PHASE MOTOR","460/3/60",4,-20,38300,43600,"-",7010,"460/3/60",2,"460/1/60",1,4.3,4.3,2000,"1/2","2-1/8","-",15,20,"-","-",303,480,"N/A","N/A"]
["W4H038JHA","HIGH STATIC","WAREHOUSE","HOT GAS - 3-PIPE - ELECTRIC PAN",1,"THREE PHASE MOTOR","575/3/60",4,-20,38300,43600,"-",7010,"575/3/60",3,"575/1/60",1,2,2,2000,"1/2","2-1/8","-",15,20,"-","-",303,480,"N/A","N/A"]
["W4H038JTA","STANDARD","WAREHOUSE","HOT GAS - 3-PIPE - ELECTRIC PAN",1,"THREE PHASE MOTOR","575/3/60",4,-20,38300,43600,"-",7010,"575/3/60",2.5,"575/1/60",1,2,2,2000,"1/2","2-1/8","-",15,20,"-","-",303,480,"N/A","N/A"]
["W4H048EHA","HIGH STATIC","WAREHOUSE","HOT GAS - 3-PIPE - ELECTRIC PAN",1,"THREE PHASE MOTOR","208-230/3/60",4,-20,48900,56000,"-",6875,"208-230/3/60",6.4,"208-230/1/60",1,8.3000000000000007,8.3000000000000007,2000,"5/8","2-1/8","-",15,20,"-","-",303,480,"N/A","N/A"]
["W4H048ETA","STANDARD","WAREHOUSE","HOT GAS - 3-PIPE - ELECTRIC PAN",1,"THREE PHASE MOTOR","208-230/3/60",4,-20,48900,56000,"-",6875,"208-230/3/60",4.0999999999999996,"208-230/1/60",1,8.3000000000000007,8.3000000000000007,2000,"5/8","2-1/8","-",15,20,"-","-",303,480,"N/A","N/A"]
["W4H048GHA","HIGH STATIC","WAREHOUSE","HOT GAS - 3-PIPE - ELECTRIC PAN",1,"THREE PHASE MOTOR","460/3/60",4,-20,48900,56000,"-",6875,"460/3/60",3.2,"460/1/60",1,4.3,4.3,2000,"5/8","2-1/8","-",15,20,"-","-",303,480,"N/A","N/A"]
["W4H048GTA","STANDARD","WAREHOUSE","HOT GAS - 3-PIPE - ELECTRIC PAN",1,"THREE PHASE MOTOR","460/3/60",4,-20,48900,56000,"-",6875,"460/3/60",2,"460/1/60",1,4.3,4.3,2000,"5/8","2-1/8","-",15,20,"-","-",303,480,"N/A","N/A"]
["W4H048JHA","HIGH STATIC","WAREHOUSE","HOT GAS - 3-PIPE - ELECTRIC PAN",1,"THREE PHASE MOTOR","575/3/60",4,-20,48900,56000,"-",6875,"575/3/60",3,"575/1/60",1,2,2,2000,"5/8","2-1/8","-",15,20,"-","-",303,480,"N/A","N/A"]
["W4H048JTA","STANDARD","WAREHOUSE","HOT GAS - 3-PIPE - ELECTRIC PAN",1,"THREE PHASE MOTOR","575/3/60",4,-20,48900,56000,"-",6875,"575/3/60",2.5,"575/1/60",1,2,2,2000,"5/8","2-1/8","-",15,20,"-","-",303,480,"N/A","N/A"]
["W4H077EHA","HIGH STATIC","WAREHOUSE","HOT GAS - 3-PIPE - ELECTRIC PAN",2,"THREE PHASE MOTOR","208-230/3/60",4,-20,77300,88600,"-",14030,"208-230/3/60",12.8,"208-230/1/60",1,16.7,16.7,4000,"5/8","2-1/8","-",15,20,"-","-",509,750,"N/A","N/A"]
["W4H077ETA","STANDARD","WAREHOUSE","HOT GAS - 3-PIPE - ELECTRIC PAN",2,"THREE PHASE MOTOR","208-230/3/60",4,-20,77300,88600,"-",14030,"208-230/3/60",8.1999999999999993,"208-230/1/60",1,16.7,16.7,4000,"5/8","2-1/8","-",15,20,"-","-",509,750,"N/A","N/A"]
["W4H077GHA","HIGH STATIC","WAREHOUSE","HOT GAS - 3-PIPE - ELECTRIC PAN",2,"THREE PHASE MOTOR","460/3/60",4,-20,77300,88600,"-",14030,"460/3/60",6.4,"460/1/60",1,8.6999999999999993,8.6999999999999993,4000,"5/8","2-1/8","-",15,20,"-","-",509,750,"N/A","N/A"]
["W4H077GTA","STANDARD","WAREHOUSE","HOT GAS - 3-PIPE - ELECTRIC PAN",2,"THREE PHASE MOTOR","460/3/60",4,-20,77300,88600,"-",14030,"460/3/60",4,"460/1/60",1,8.6999999999999993,8.6999999999999993,4000,"5/8","2-1/8","-",15,20,"-","-",509,750,"N/A","N/A"]
["W4H077JHA","HIGH STATIC","WAREHOUSE","HOT GAS - 3-PIPE - ELECTRIC PAN",2,"THREE PHASE MOTOR","575/3/60",4,-20,77300,88600,"-",14030,"575/3/60",6,"575/1/60",1,4,4,4000,"5/8","2-1/8","-",15,20,"-","-",509,750,"N/A","N/A"]
["W4H077JTA","STANDARD","WAREHOUSE","HOT GAS - 3-PIPE - ELECTRIC PAN",2,"THREE PHASE MOTOR","575/3/60",4,-20,77300,88600,"-",14030,"575/3/60",5,"575/1/60",1,4,4,4000,"5/8","2-1/8","-",15,20,"-","-",509,750,"N/A","N/A"]
["W4H097EHA","HIGH STATIC","WAREHOUSE","HOT GAS - 3-PIPE - ELECTRIC PAN",2,"THREE PHASE MOTOR","208-230/3/60",4,-20,97000,111000,"-",13750,"208-230/3/60",12.8,"208-230/1/60",1,16.7,16.7,4000,"7/8","3-1/8","-",15,20,"-","-",509,750,"N/A","N/A"]
["W4H097ETA","STANDARD","WAREHOUSE","HOT GAS - 3-PIPE - ELECTRIC PAN",2,"THREE PHASE MOTOR","208-230/3/60",4,-20,97000,111000,"-",13750,"208-230/3/60",8.1999999999999993,"208-230/1/60",1,16.7,16.7,4000,"7/8","3-1/8","-",15,20,"-","-",509,750,"N/A","N/A"]
["W4H097GHA","HIGH STATIC","WAREHOUSE","HOT GAS - 3-PIPE - ELECTRIC PAN",2,"THREE PHASE MOTOR","460/3/60",4,-20,97000,111000,"-",13750,"460/3/60",6.4,"460/1/60",1,8.6999999999999993,8.6999999999999993,4000,"7/8","3-1/8","-",15,20,"-","-",509,750,"N/A","N/A"]
["W4H097GTA","STANDARD","WAREHOUSE","HOT GAS - 3-PIPE - ELECTRIC PAN",2,"THREE PHASE MOTOR","460/3/60",4,-20,97000,111000,"-",13750,"460/3/60",4,"460/1/60",1,8.6999999999999993,8.6999999999999993,4000,"7/8","3-1/8","-",15,20,"-","-",509,750,"N/A","N/A"]
["W4H097JHA","HIGH STATIC","WAREHOUSE","HOT GAS - 3-PIPE - ELECTRIC PAN",2,"THREE PHASE MOTOR","575/3/60",4,-20,97000,111000,"-",13750,"575/3/60",6,"575/1/60",1,4,4,4000,"7/8","3-1/8","-",15,20,"-","-",509,750,"N/A","N/A"]
["W4H097JTA","STANDARD","WAREHOUSE","HOT GAS - 3-PIPE - ELECTRIC PAN",2,"THREE PHASE MOTOR","575/3/60",4,-20,97000,111000,"-",13750,"575/3/60",5,"575/1/60",1,4,4,4000,"7/8","3-1/8","-",15,20,"-","-",509,750,"N/A","N/A"]
["W4H115EHA","HIGH STATIC","WAREHOUSE","HOT GAS - 3-PIPE - ELECTRIC PAN",3,"THREE PHASE MOTOR","208-230/3/60",4,-20,115600,131200,"-",21040,"208-230/3/60",19.2,"208-230/1/60",1,25,25,6000,"7/8","3-1/8","-",20.8,25,"-","-",682,1030,"N/A","N/A"]
["W4H115ETA","STANDARD","WAREHOUSE","HOT GAS - 3-PIPE - ELECTRIC PAN",3,"THREE PHASE MOTOR","208-230/3/60",4,-20,115600,131200,"-",21040,"208-230/3/60",12.3,"208-230/1/60",1,25,25,6000,"7/8","3-1/8","-",15,20,"-","-",682,1030,"N/A","N/A"]
["W4H115GHA","HIGH STATIC","WAREHOUSE","HOT GAS - 3-PIPE - ELECTRIC PAN",3,"THREE PHASE MOTOR","460/3/60",4,-20,115600,131200,"-",21040,"460/3/60",9.6,"460/1/60",1,13,13,6000,"7/8","3-1/8","-",15,20,"-","-",682,1030,"N/A","N/A"]
["W4H115GTA","STANDARD","WAREHOUSE","HOT GAS - 3-PIPE - ELECTRIC PAN",3,"THREE PHASE MOTOR","460/3/60",4,-20,115600,131200,"-",21040,"460/3/60",6,"460/1/60",1,13,13,6000,"7/8","3-1/8","-",15,20,"-","-",682,1030,"N/A","N/A"]
["W4H115JHA","HIGH STATIC","WAREHOUSE","HOT GAS - 3-PIPE - ELECTRIC PAN",3,"THREE PHASE MOTOR","575/3/60",4,-20,115600,131200,"-",21040,"575/3/60",9,"575/1/60",1,6,6,6000,"7/8","3-1/8","-",15,20,"-","-",682,1030,"N/A","N/A"]
["W4H115JTA","STANDARD","WAREHOUSE","HOT GAS - 3-PIPE - ELECTRIC PAN",3,"THREE PHASE MOTOR","575/3/60",4,-20,115600,131200,"-",21040,"575/3/60",7.5,"575/1/60",1,6,6,6000,"7/8","3-1/8","-",15,20,"-","-",682,1030,"N/A","N/A"]
["W4H145EHA","HIGH STATIC","WAREHOUSE","HOT GAS - 3-PIPE - ELECTRIC PAN",3,"THREE PHASE MOTOR","208-230/3/60",4,-20,145700,166400,"-",20625,"208-230/3/60",19.2,"208-230/1/60",1,25,25,6000,"1-1/8","3-1/8","-",20.8,25,"-","-",682,1030,"N/A","N/A"]
["W4H145ETA","STANDARD","WAREHOUSE","HOT GAS - 3-PIPE - ELECTRIC PAN",3,"THREE PHASE MOTOR","208-230/3/60",4,-20,145700,166400,"-",20625,"208-230/3/60",12.3,"208-230/1/60",1,25,25,6000,"1-1/8","3-1/8","-",15,20,"-","-",682,1030,"N/A","N/A"]
["W4H145GHA","HIGH STATIC","WAREHOUSE","HOT GAS - 3-PIPE - ELECTRIC PAN",3,"THREE PHASE MOTOR","460/3/60",4,-20,145700,166400,"-",20625,"460/3/60",9.6,"460/1/60",1,13,13,6000,"1-1/8","3-1/8","-",15,20,"-","-",682,1030,"N/A","N/A"]
["W4H145GTA","STANDARD","WAREHOUSE","HOT GAS - 3-PIPE - ELECTRIC PAN",3,"THREE PHASE MOTOR","460/3/60",4,-20,145700,166400,"-",20625,"460/3/60",6,"460/1/60",1,13,13,6000,"1-1/8","3-1/8","-",15,20,"-","-",682,1030,"N/A","N/A"]
["W4H145JHA","HIGH STATIC","WAREHOUSE","HOT GAS - 3-PIPE - ELECTRIC PAN",3,"THREE PHASE MOTOR","575/3/60",4,-20,145700,166400,"-",20625,"575/3/60",9,"575/1/60",1,6,6,6000,"1-1/8","3-1/8","-",15,20,"-","-",682,1030,"N/A","N/A"]
["W4H145JTA","STANDARD","WAREHOUSE","HOT GAS - 3-PIPE - ELECTRIC PAN",3,"THREE PHASE MOTOR","575/3/60",4,-20,145700,166400,"-",20625,"575/3/60",7.5,"575/1/60",1,6,6,6000,"1-1/8","3-1/8","-",15,20,"-","-",682,1030,"N/A","N/A"]
["W4H182EHA","HIGH STATIC","WAREHOUSE","HOT GAS - 3-PIPE - ELECTRIC PAN",4,"THREE PHASE MOTOR","208-230/3/60",4,-20,182200,206500,"-",27500,"208-230/3/60",25.6,"208-230/1/60",1,33.299999999999997,33.299999999999997,8000,"1-1/8","3-1/8","-",27.2,30,"-","-",1050,1360,"N/A","N/A"]
["W4H182ETA","STANDARD","WAREHOUSE","HOT GAS - 3-PIPE - ELECTRIC PAN",4,"THREE PHASE MOTOR","208-230/3/60",4,-20,182200,206500,"-",27500,"208-230/3/60",16.399999999999999,"208-230/1/60",1,33.299999999999997,33.299999999999997,8000,"1-1/8","3-1/8","-",17.399999999999999,20,"-","-",1050,1360,"N/A","N/A"]
["W4H182GHA","HIGH STATIC","WAREHOUSE","HOT GAS - 3-PIPE - ELECTRIC PAN",4,"THREE PHASE MOTOR","460/3/60",4,-20,182200,206500,"-",27500,"460/3/60",12.8,"460/1/60",1,17.399999999999999,17.399999999999999,8000,"1-1/8","3-1/8","-",15,20,"-","-",1050,1360,"N/A","N/A"]
["W4H182GTA","STANDARD","WAREHOUSE","HOT GAS - 3-PIPE - ELECTRIC PAN",4,"THREE PHASE MOTOR","460/3/60",4,-20,182200,206500,"-",27500,"460/3/60",8,"460/1/60",1,17.399999999999999,17.399999999999999,8000,"1-1/8","3-1/8","-",15,20,"-","-",1050,1360,"N/A","N/A"]
["W4H182JHA","HIGH STATIC","WAREHOUSE","HOT GAS - 3-PIPE - ELECTRIC PAN",4,"THREE PHASE MOTOR","575/3/60",4,-20,182200,206500,"-",27500,"575/3/60",12,"575/1/60",1,8,8,8000,"1-1/8","3-1/8","-",15,20,"-","-",1050,1360,"N/A","N/A"]
["W4H182JTA","STANDARD","WAREHOUSE","HOT GAS - 3-PIPE - ELECTRIC PAN",4,"THREE PHASE MOTOR","575/3/60",4,-20,182200,206500,"-",27500,"575/3/60",10,"575/1/60",1,8,8,8000,"1-1/8","3-1/8","-",15,20,"-","-",1050,1360,"N/A","N/A"]
["W4K038EHA","HIGH STATIC","WAREHOUSE","HOT GAS - 3-PIPE - HOT GAS PAN",1,"THREE PHASE MOTOR","208-230/3/60",4,-20,38300,43600,"-",7010,"208-230/3/60",6.4,"-","-","-","-","-","1/2","2-1/8",1.125,15,20,"-","-",303,480,"N/A","N/A"]
["W4K038ETA","STANDARD","WAREHOUSE","HOT GAS - 3-PIPE - HOT GAS PAN",1,"THREE PHASE MOTOR","208-230/3/60",4,-20,38300,43600,"-",7010,"208-230/3/60",4.0999999999999996,"-","-","-","-","-","1/2","2-1/8",1.125,15,20,"-","-",303,480,"N/A","N/A"]
["W4K038GHA","HIGH STATIC","WAREHOUSE","HOT GAS - 3-PIPE - HOT GAS PAN",1,"THREE PHASE MOTOR","460/3/60",4,-20,38300,43600,"-",7010,"460/3/60",3.2,"-","-","-","-","-","1/2","2-1/8",1.125,15,20,"-","-",303,480,"N/A","N/A"]
["W4K038GTA","STANDARD","WAREHOUSE","HOT GAS - 3-PIPE - HOT GAS PAN",1,"THREE PHASE MOTOR","460/3/60",4,-20,38300,43600,"-",7010,"460/3/60",2,"-","-","-","-","-","1/2","2-1/8",1.125,15,20,"-","-",303,480,"N/A","N/A"]
["W4K038JHA","HIGH STATIC","WAREHOUSE","HOT GAS - 3-PIPE - HOT GAS PAN",1,"THREE PHASE MOTOR","575/3/60",4,-20,38300,43600,"-",7010,"575/3/60",3,"-","-","-","-","-","1/2","2-1/8",1.125,15,20,"-","-",303,480,"N/A","N/A"]
["W4K038JTA","STANDARD","WAREHOUSE","HOT GAS - 3-PIPE - HOT GAS PAN",1,"THREE PHASE MOTOR","575/3/60",4,-20,38300,43600,"-",7010,"575/3/60",2.5,"-","-","-","-","-","1/2","2-1/8",1.125,15,20,"-","-",303,480,"N/A","N/A"]
["W4K048EHA","HIGH STATIC","WAREHOUSE","HOT GAS - 3-PIPE - HOT GAS PAN",1,"THREE PHASE MOTOR","208-230/3/60",4,-20,48900,56000,"-",6875,"208-230/3/60",6.4,"-","-","-","-","-","5/8","2-1/8",1.125,15,20,"-","-",303,480,"N/A","N/A"]
["W4K048ETA","STANDARD","WAREHOUSE","HOT GAS - 3-PIPE - HOT GAS PAN",1,"THREE PHASE MOTOR","208-230/3/60",4,-20,48900,56000,"-",6875,"208-230/3/60",4.0999999999999996,"-","-","-","-","-","5/8","2-1/8",1.125,15,20,"-","-",303,480,"N/A","N/A"]
["W4K048GHA","HIGH STATIC","WAREHOUSE","HOT GAS - 3-PIPE - HOT GAS PAN",1,"THREE PHASE MOTOR","460/3/60",4,-20,48900,56000,"-",6875,"460/3/60",3.2,"-","-","-","-","-","5/8","2-1/8",1.125,15,20,"-","-",303,480,"N/A","N/A"]
["W4K048GTA","STANDARD","WAREHOUSE","HOT GAS - 3-PIPE - HOT GAS PAN",1,"THREE PHASE MOTOR","460/3/60",4,-20,48900,56000,"-",6875,"460/3/60",2,"-","-","-","-","-","5/8","2-1/8",1.125,15,20,"-","-",303,480,"N/A","N/A"]
["W4K048JHA","HIGH STATIC","WAREHOUSE","HOT GAS - 3-PIPE - HOT GAS PAN",1,"THREE PHASE MOTOR","575/3/60",4,-20,48900,56000,"-",6875,"575/3/60",3,"-","-","-","-","-","5/8","2-1/8",1.125,15,20,"-","-",303,480,"N/A","N/A"]
["W4K048JTA","STANDARD","WAREHOUSE","HOT GAS - 3-PIPE - HOT GAS PAN",1,"THREE PHASE MOTOR","575/3/60",4,-20,48900,56000,"-",6875,"575/3/60",2.5,"-","-","-","-","-","5/8","2-1/8",1.125,15,20,"-","-",303,480,"N/A","N/A"]
["W4K077EHA","HIGH STATIC","WAREHOUSE","HOT GAS - 3-PIPE - HOT GAS PAN",2,"THREE PHASE MOTOR","208-230/3/60",4,-20,77300,88600,"-",14030,"208-230/3/60",12.8,"-","-","-","-","-","5/8","2-1/8",1.125,15,20,"-","-",509,750,"N/A","N/A"]
["W4K077ETA","STANDARD","WAREHOUSE","HOT GAS - 3-PIPE - HOT GAS PAN",2,"THREE PHASE MOTOR","208-230/3/60",4,-20,77300,88600,"-",14030,"208-230/3/60",8.1999999999999993,"-","-","-","-","-","5/8","2-1/8",1.125,15,20,"-","-",509,750,"N/A","N/A"]
["W4K077GHA","HIGH STATIC","WAREHOUSE","HOT GAS - 3-PIPE - HOT GAS PAN",2,"THREE PHASE MOTOR","460/3/60",4,-20,77300,88600,"-",14030,"460/3/60",6.4,"-","-","-","-","-","5/8","2-1/8",1.125,15,20,"-","-",509,750,"N/A","N/A"]
["W4K077GTA","STANDARD","WAREHOUSE","HOT GAS - 3-PIPE - HOT GAS PAN",2,"THREE PHASE MOTOR","460/3/60",4,-20,77300,88600,"-",14030,"460/3/60",4,"-","-","-","-","-","5/8","2-1/8",1.125,15,20,"-","-",509,750,"N/A","N/A"]
["W4K077JHA","HIGH STATIC","WAREHOUSE","HOT GAS - 3-PIPE - HOT GAS PAN",2,"THREE PHASE MOTOR","575/3/60",4,-20,77300,88600,"-",14030,"575/3/60",6,"-","-","-","-","-","5/8","2-1/8",1.125,15,20,"-","-",509,750,"N/A","N/A"]
["W4K077JTA","STANDARD","WAREHOUSE","HOT GAS - 3-PIPE - HOT GAS PAN",2,"THREE PHASE MOTOR","575/3/60",4,-20,77300,88600,"-",14030,"575/3/60",5,"-","-","-","-","-","5/8","2-1/8",1.125,15,20,"-","-",509,750,"N/A","N/A"]
["W4K097EHA","HIGH STATIC","WAREHOUSE","HOT GAS - 3-PIPE - HOT GAS PAN",2,"THREE PHASE MOTOR","208-230/3/60",4,-20,97000,111000,"-",13750,"208-230/3/60",12.8,"-","-","-","-","-","7/8","3-1/8",1.125,15,20,"-","-",509,750,"N/A","N/A"]
["W4K097ETA","STANDARD","WAREHOUSE","HOT GAS - 3-PIPE - HOT GAS PAN",2,"THREE PHASE MOTOR","208-230/3/60",4,-20,97000,111000,"-",13750,"208-230/3/60",8.1999999999999993,"-","-","-","-","-","7/8","3-1/8",1.125,15,20,"-","-",509,750,"N/A","N/A"]
["W4K097GHA","HIGH STATIC","WAREHOUSE","HOT GAS - 3-PIPE - HOT GAS PAN",2,"THREE PHASE MOTOR","460/3/60",4,-20,97000,111000,"-",13750,"460/3/60",6.4,"-","-","-","-","-","7/8","3-1/8",1.125,15,20,"-","-",509,750,"N/A","N/A"]
["W4K097GTA","STANDARD","WAREHOUSE","HOT GAS - 3-PIPE - HOT GAS PAN",2,"THREE PHASE MOTOR","460/3/60",4,-20,97000,111000,"-",13750,"460/3/60",4,"-","-","-","-","-","7/8","3-1/8",1.125,15,20,"-","-",509,750,"N/A","N/A"]
["W4K097JHA","HIGH STATIC","WAREHOUSE","HOT GAS - 3-PIPE - HOT GAS PAN",2,"THREE PHASE MOTOR","575/3/60",4,-20,97000,111000,"-",13750,"575/3/60",6,"-","-","-","-","-","7/8","3-1/8",1.125,15,20,"-","-",509,750,"N/A","N/A"]
["W4K097JTA","STANDARD","WAREHOUSE","HOT GAS - 3-PIPE - HOT GAS PAN",2,"THREE PHASE MOTOR","575/3/60",4,-20,97000,111000,"-",13750,"575/3/60",5,"-","-","-","-","-","7/8","3-1/8",1.125,15,20,"-","-",509,750,"N/A","N/A"]
["W4K115EHA","HIGH STATIC","WAREHOUSE","HOT GAS - 3-PIPE - HOT GAS PAN",3,"THREE PHASE MOTOR","208-230/3/60",4,-20,115600,131200,"-",21040,"208-230/3/60",19.2,"-","-","-","-","-","7/8","3-1/8",1.375,20.8,25,"-","-",682,1030,"N/A","N/A"]
["W4K115ETA","STANDARD","WAREHOUSE","HOT GAS - 3-PIPE - HOT GAS PAN",3,"THREE PHASE MOTOR","208-230/3/60",4,-20,115600,131200,"-",21040,"208-230/3/60",12.3,"-","-","-","-","-","7/8","3-1/8",1.375,15,20,"-","-",682,1030,"N/A","N/A"]
["W4K115GHA","HIGH STATIC","WAREHOUSE","HOT GAS - 3-PIPE - HOT GAS PAN",3,"THREE PHASE MOTOR","460/3/60",4,-20,115600,131200,"-",21040,"460/3/60",9.6,"-","-","-","-","-","7/8","3-1/8",1.375,15,20,"-","-",682,1030,"N/A","N/A"]
["W4K115GTA","STANDARD","WAREHOUSE","HOT GAS - 3-PIPE - HOT GAS PAN",3,"THREE PHASE MOTOR","460/3/60",4,-20,115600,131200,"-",21040,"460/3/60",6,"-","-","-","-","-","7/8","3-1/8",1.375,15,20,"-","-",682,1030,"N/A","N/A"]
["W4K115JHA","HIGH STATIC","WAREHOUSE","HOT GAS - 3-PIPE - HOT GAS PAN",3,"THREE PHASE MOTOR","575/3/60",4,-20,115600,131200,"-",21040,"575/3/60",9,"-","-","-","-","-","7/8","3-1/8",1.375,15,20,"-","-",682,1030,"N/A","N/A"]
["W4K115JTA","STANDARD","WAREHOUSE","HOT GAS - 3-PIPE - HOT GAS PAN",3,"THREE PHASE MOTOR","575/3/60",4,-20,115600,131200,"-",21040,"575/3/60",7.5,"-","-","-","-","-","7/8","3-1/8",1.375,15,20,"-","-",682,1030,"N/A","N/A"]
["W4K145EHA","HIGH STATIC","WAREHOUSE","HOT GAS - 3-PIPE - HOT GAS PAN",3,"THREE PHASE MOTOR","208-230/3/60",4,-20,145700,166400,"-",20625,"208-230/3/60",19.2,"-","-","-","-","-","1-1/8","3-1/8",1.375,20.8,25,"-","-",682,1030,"N/A","N/A"]
["W4K145ETA","STANDARD","WAREHOUSE","HOT GAS - 3-PIPE - HOT GAS PAN",3,"THREE PHASE MOTOR","208-230/3/60",4,-20,145700,166400,"-",20625,"208-230/3/60",12.3,"-","-","-","-","-","1-1/8","3-1/8",1.375,15,20,"-","-",682,1030,"N/A","N/A"]
["W4K145GHA","HIGH STATIC","WAREHOUSE","HOT GAS - 3-PIPE - HOT GAS PAN",3,"THREE PHASE MOTOR","460/3/60",4,-20,145700,166400,"-",20625,"460/3/60",9.6,"-","-","-","-","-","1-1/8","3-1/8",1.375,15,20,"-","-",682,1030,"N/A","N/A"]
["W4K145GTA","STANDARD","WAREHOUSE","HOT GAS - 3-PIPE - HOT GAS PAN",3,"THREE PHASE MOTOR","460/3/60",4,-20,145700,166400,"-",20625,"460/3/60",6,"-","-","-","-","-","1-1/8","3-1/8",1.375,15,20,"-","-",682,1030,"N/A","N/A"]
["W4K145JHA","HIGH STATIC","WAREHOUSE","HOT GAS - 3-PIPE - HOT GAS PAN",3,"THREE PHASE MOTOR","575/3/60",4,-20,145700,166400,"-",20625,"575/3/60",9,"-","-","-","-","-","1-1/8","3-1/8",1.375,15,20,"-","-",682,1030,"N/A","N/A"]
["W4K145JTA","STANDARD","WAREHOUSE","HOT GAS - 3-PIPE - HOT GAS PAN",3,"THREE PHASE MOTOR","575/3/60",4,-20,145700,166400,"-",20625,"575/3/60",7.5,"-","-","-","-","-","1-1/8","3-1/8",1.375,15,20,"-","-",682,1030,"N/A","N/A"]
["W4K182EHA","HIGH STATIC","WAREHOUSE","HOT GAS - 3-PIPE - HOT GAS PAN",4,"THREE PHASE MOTOR","208-230/3/60",4,-20,182200,206500,"-",27500,"208-230/3/60",25.6,"-","-","-","-","-","1-1/8","3-1/8",1.375,27.2,30,"-","-",1050,1360,"N/A","N/A"]
["W4K182ETA","STANDARD","WAREHOUSE","HOT GAS - 3-PIPE - HOT GAS PAN",4,"THREE PHASE MOTOR","208-230/3/60",4,-20,182200,206500,"-",27500,"208-230/3/60",16.399999999999999,"-","-","-","-","-","1-1/8","3-1/8",1.375,17.399999999999999,20,"-","-",1050,1360,"N/A","N/A"]
["W4K182GHA","HIGH STATIC","WAREHOUSE","HOT GAS - 3-PIPE - HOT GAS PAN",4,"THREE PHASE MOTOR","460/3/60",4,-20,182200,206500,"-",27500,"460/3/60",12.8,"-","-","-","-","-","1-1/8","3-1/8",1.375,15,20,"-","-",1050,1360,"N/A","N/A"]
["W4K182GTA","STANDARD","WAREHOUSE","HOT GAS - 3-PIPE - HOT GAS PAN",4,"THREE PHASE MOTOR","460/3/60",4,-20,182200,206500,"-",27500,"460/3/60",8,"-","-","-","-","-","1-1/8","3-1/8",1.375,15,20,"-","-",1050,1360,"N/A","N/A"]
["W4K182JHA","HIGH STATIC","WAREHOUSE","HOT GAS - 3-PIPE - HOT GAS PAN",4,"THREE PHASE MOTOR","575/3/60",4,-20,182200,206500,"-",27500,"575/3/60",12,"-","-","-","-","-","1-1/8","3-1/8",1.375,15,20,"-","-",1050,1360,"N/A","N/A"]
["W4K182JTA","STANDARD","WAREHOUSE","HOT GAS - 3-PIPE - HOT GAS PAN",4,"THREE PHASE MOTOR","575/3/60",4,-20,182200,206500,"-",27500,"575/3/60",10,"-","-","-","-","-","1-1/8","3-1/8",1.375,15,20,"-","-",1050,1360,"N/A","N/A"]
["W4L038EHA","HIGH STATIC","WAREHOUSE","HOT GAS - REVERSE CYCLE - HOT GAS PAN",1,"THREE PHASE MOTOR","208-230/3/60",4,-20,38300,43600,"-",7010,"208-230/3/60",6.4,"-","-","-","-","-","1/2","2-1/8",1.125,15,20,"-","-",303,480,"N/A","N/A"]
["W4L038ETA","STANDARD","WAREHOUSE","HOT GAS - REVERSE CYCLE - HOT GAS PAN",1,"THREE PHASE MOTOR","208-230/3/60",4,-20,38300,43600,"-",7010,"208-230/3/60",4.0999999999999996,"-","-","-","-","-","1/2","2-1/8",1.125,15,20,"-","-",303,480,"N/A","N/A"]
["W4L038GHA","HIGH STATIC","WAREHOUSE","HOT GAS - REVERSE CYCLE - HOT GAS PAN",1,"THREE PHASE MOTOR","460/3/60",4,-20,38300,43600,"-",7010,"460/3/60",3.2,"-","-","-","-","-","1/2","2-1/8",1.125,15,20,"-","-",303,480,"N/A","N/A"]
["W4L038GTA","STANDARD","WAREHOUSE","HOT GAS - REVERSE CYCLE - HOT GAS PAN",1,"THREE PHASE MOTOR","460/3/60",4,-20,38300,43600,"-",7010,"460/3/60",2,"-","-","-","-","-","1/2","2-1/8",1.125,15,20,"-","-",303,480,"N/A","N/A"]
["W4L038JHA","HIGH STATIC","WAREHOUSE","HOT GAS - REVERSE CYCLE - HOT GAS PAN",1,"THREE PHASE MOTOR","575/3/60",4,-20,38300,43600,"-",7010,"575/3/60",3,"-","-","-","-","-","1/2","2-1/8",1.125,15,20,"-","-",303,480,"N/A","N/A"]
["W4L038JTA","STANDARD","WAREHOUSE","HOT GAS - REVERSE CYCLE - HOT GAS PAN",1,"THREE PHASE MOTOR","575/3/60",4,-20,38300,43600,"-",7010,"575/3/60",2.5,"-","-","-","-","-","1/2","2-1/8",1.125,15,20,"-","-",303,480,"N/A","N/A"]
["W4L048EHA","HIGH STATIC","WAREHOUSE","HOT GAS - REVERSE CYCLE - HOT GAS PAN",1,"THREE PHASE MOTOR","208-230/3/60",4,-20,48900,56000,"-",6875,"208-230/3/60",6.4,"-","-","-","-","-","5/8","2-1/8",1.125,15,20,"-","-",303,480,"N/A","N/A"]
["W4L048ETA","STANDARD","WAREHOUSE","HOT GAS - REVERSE CYCLE - HOT GAS PAN",1,"THREE PHASE MOTOR","208-230/3/60",4,-20,48900,56000,"-",6875,"208-230/3/60",4.0999999999999996,"-","-","-","-","-","5/8","2-1/8",1.125,15,20,"-","-",303,480,"N/A","N/A"]
["W4L048GHA","HIGH STATIC","WAREHOUSE","HOT GAS - REVERSE CYCLE - HOT GAS PAN",1,"THREE PHASE MOTOR","460/3/60",4,-20,48900,56000,"-",6875,"460/3/60",3.2,"-","-","-","-","-","5/8","2-1/8",1.125,15,20,"-","-",303,480,"N/A","N/A"]
["W4L048GTA","STANDARD","WAREHOUSE","HOT GAS - REVERSE CYCLE - HOT GAS PAN",1,"THREE PHASE MOTOR","460/3/60",4,-20,48900,56000,"-",6875,"460/3/60",2,"-","-","-","-","-","5/8","2-1/8",1.125,15,20,"-","-",303,480,"N/A","N/A"]
["W4L048JHA","HIGH STATIC","WAREHOUSE","HOT GAS - REVERSE CYCLE - HOT GAS PAN",1,"THREE PHASE MOTOR","575/3/60",4,-20,48900,56000,null,6875,"575/3/60",3,"-","-","-","-","-","5/8","2-1/8",1.125,15,20,"-","-",303,480,"N/A","N/A"]
["W4L048JTA","STANDARD","WAREHOUSE","HOT GAS - REVERSE CYCLE - HOT GAS PAN",1,"THREE PHASE MOTOR","575/3/60",4,-20,48900,56000,"-",6875,"575/3/60",2.5,"-","-","-","-","-","5/8","2-1/8",1.125,15,20,"-","-",303,480,"N/A","N/A"]
["W4L077EHA","HIGH STATIC","WAREHOUSE","HOT GAS - REVERSE CYCLE - HOT GAS PAN",2,"THREE PHASE MOTOR","208-230/3/60",4,-20,77300,88600,"-",14030,"208-230/3/60",12.8,"-","-","-","-","-","5/8","2-1/8",1.125,15,20,"-","-",509,750,"N/A","N/A"]
["W4L077ETA","STANDARD","WAREHOUSE","HOT GAS - REVERSE CYCLE - HOT GAS PAN",2,"THREE PHASE MOTOR","208-230/3/60",4,-20,77300,88600,"-",14030,"208-230/3/60",8.1999999999999993,"-","-","-","-","-","5/8","2-1/8",1.125,15,20,"-","-",509,750,"N/A","N/A"]
["W4L077GHA","HIGH STATIC","WAREHOUSE","HOT GAS - REVERSE CYCLE - HOT GAS PAN",2,"THREE PHASE MOTOR","460/3/60",4,-20,77300,88600,"-",14030,"460/3/60",6.4,"-","-","-","-","-","5/8","2-1/8",1.125,15,20,"-","-",509,750,"N/A","N/A"]
["W4L077GTA","STANDARD","WAREHOUSE","HOT GAS - REVERSE CYCLE - HOT GAS PAN",2,"THREE PHASE MOTOR","460/3/60",4,-20,77300,88600,"-",14030,"460/3/60",4,"-","-","-","-","-","5/8","2-1/8",1.125,15,20,"-","-",509,750,"N/A","N/A"]
["W4L077JHA","HIGH STATIC","WAREHOUSE","HOT GAS - REVERSE CYCLE - HOT GAS PAN",2,"THREE PHASE MOTOR","575/3/60",4,-20,77300,88600,null,14030,"575/3/60",6,"-","-","-","-","-","5/8","2-1/8",1.125,15,20,"-","-",509,750,"N/A","N/A"]
["W4L077JTA","STANDARD","WAREHOUSE","HOT GAS - REVERSE CYCLE - HOT GAS PAN",2,"THREE PHASE MOTOR","575/3/60",4,-20,77300,88600,"-",14030,"575/3/60",5,"-","-","-","-","-","5/8","2-1/8",1.125,15,20,"-","-",509,750,"N/A","N/A"]
["W4L097EHA","HIGH STATIC","WAREHOUSE","HOT GAS - REVERSE CYCLE - HOT GAS PAN",2,"THREE PHASE MOTOR","208-230/3/60",4,-20,97000,111000,"-",13750,"208-230/3/60",12.8,"-","-","-","-","-","7/8","3-1/8",1.125,15,20,"-","-",509,750,"N/A","N/A"]
["W4L097ETA","STANDARD","WAREHOUSE","HOT GAS - REVERSE CYCLE - HOT GAS PAN",2,"THREE PHASE MOTOR","208-230/3/60",4,-20,97000,111000,"-",13750,"208-230/3/60",8.1999999999999993,"-","-","-","-","-","7/8","3-1/8",1.125,15,20,"-","-",509,750,"N/A","N/A"]
["W4L097GHA","HIGH STATIC","WAREHOUSE","HOT GAS - REVERSE CYCLE - HOT GAS PAN",2,"THREE PHASE MOTOR","460/3/60",4,-20,97000,111000,"-",13750,"460/3/60",6.4,"-","-","-","-","-","7/8","3-1/8",1.125,15,20,"-","-",509,750,"N/A","N/A"]
["W4L097GTA","STANDARD","WAREHOUSE","HOT GAS - REVERSE CYCLE - HOT GAS PAN",2,"THREE PHASE MOTOR","460/3/60",4,-20,97000,111000,"-",13750,"460/3/60",4,"-","-","-","-","-","7/8","3-1/8",1.125,15,20,"-","-",509,750,"N/A","N/A"]
["W4L097JHA","HIGH STATIC","WAREHOUSE","HOT GAS - REVERSE CYCLE - HOT GAS PAN",2,"THREE PHASE MOTOR","575/3/60",4,-20,97000,111000,null,13750,"575/3/60",6,"-","-","-","-","-","7/8","3-1/8",1.125,15,20,"-","-",509,750,"N/A","N/A"]
["W4L097JTA","STANDARD","WAREHOUSE","HOT GAS - REVERSE CYCLE - HOT GAS PAN",2,"THREE PHASE MOTOR","575/3/60",4,-20,97000,111000,"-",13750,"575/3/60",5,"-","-","-","-","-","7/8","3-1/8",1.125,15,20,"-","-",509,750,"N/A","N/A"]
["W4L115EHA","HIGH STATIC","WAREHOUSE","HOT GAS - REVERSE CYCLE - HOT GAS PAN",3,"THREE PHASE MOTOR","208-230/3/60",4,-20,115600,131200,"-",21040,"208-230/3/60",19.2,"-","-","-","-","-","7/8","3-1/8",1.375,20.8,25,"-","-",682,1030,"N/A","N/A"]
["W4L115ETA","STANDARD","WAREHOUSE","HOT GAS - REVERSE CYCLE - HOT GAS PAN",3,"THREE PHASE MOTOR","208-230/3/60",4,-20,115600,131200,"-",21040,"208-230/3/60",12.3,"-","-","-","-","-","7/8","3-1/8",1.375,15,20,"-","-",682,1030,"N/A","N/A"]
["W4L115GHA","HIGH STATIC","WAREHOUSE","HOT GAS - REVERSE CYCLE - HOT GAS PAN",3,"THREE PHASE MOTOR","460/3/60",4,-20,115600,131200,"-",21040,"460/3/60",9.6,"-","-","-","-","-","7/8","3-1/8",1.375,15,20,"-","-",682,1030,"N/A","N/A"]
["W4L115GTA","STANDARD","WAREHOUSE","HOT GAS - REVERSE CYCLE - HOT GAS PAN",3,"THREE PHASE MOTOR","460/3/60",4,-20,115600,131200,"-",21040,"460/3/60",6,"-","-","-","-","-","7/8","3-1/8",1.375,15,20,"-","-",682,1030,"N/A","N/A"]
["W4L115JHA","HIGH STATIC","WAREHOUSE","HOT GAS - REVERSE CYCLE - HOT GAS PAN",3,"THREE PHASE MOTOR","575/3/60",4,-20,115600,131200,null,21040,"575/3/60",9,"-","-","-","-","-","7/8","3-1/8",1.375,15,20,"-","-",682,1030,"N/A","N/A"]
["W4L115JTA","STANDARD","WAREHOUSE","HOT GAS - REVERSE CYCLE - HOT GAS PAN",3,"THREE PHASE MOTOR","575/3/60",4,-20,115600,131200,"-",21040,"575/3/60",7.5,"-","-","-","-","-","7/8","3-1/8",1.375,15,20,"-","-",682,1030,"N/A","N/A"]
["W4L145EHA","HIGH STATIC","WAREHOUSE","HOT GAS - REVERSE CYCLE - HOT GAS PAN",3,"THREE PHASE MOTOR","208-230/3/60",4,-20,145700,166400,"-",20625,"208-230/3/60",19.2,"-","-","-","-","-","1-1/8","3-1/8",1.375,20.8,25,"-","-",682,1030,"N/A","N/A"]
["W4L145ETA","STANDARD","WAREHOUSE","HOT GAS - REVERSE CYCLE - HOT GAS PAN",3,"THREE PHASE MOTOR","208-230/3/60",4,-20,145700,166400,"-",20625,"208-230/3/60",12.3,"-","-","-","-","-","1-1/8","3-1/8",1.375,15,20,"-","-",682,1030,"N/A","N/A"]
["W4L145GHA","HIGH STATIC","WAREHOUSE","HOT GAS - REVERSE CYCLE - HOT GAS PAN",3,"THREE PHASE MOTOR","460/3/60",4,-20,145700,166400,"-",20625,"460/3/60",9.6,"-","-","-","-","-","1-1/8","3-1/8",1.375,15,20,"-","-",682,1030,"N/A","N/A"]
["W4L145GTA","STANDARD","WAREHOUSE","HOT GAS - REVERSE CYCLE - HOT GAS PAN",3,"THREE PHASE MOTOR","460/3/60",4,-20,145700,166400,"-",20625,"460/3/60",6,"-","-","-","-","-","1-1/8","3-1/8",1.375,15,20,"-","-",682,1030,"N/A","N/A"]
["W4L145JHA","HIGH STATIC","WAREHOUSE","HOT GAS - REVERSE CYCLE - HOT GAS PAN",3,"THREE PHASE MOTOR","575/3/60",4,-20,145700,166400,null,20625,"575/3/60",9,"-","-","-","-","-","1-1/8","3-1/8",1.375,15,20,"-","-",682,1030,"N/A","N/A"]
["W4L145JTA","STANDARD","WAREHOUSE","HOT GAS - REVERSE CYCLE - HOT GAS PAN",3,"THREE PHASE MOTOR","575/3/60",4,-20,145700,166400,"-",20625,"575/3/60",7.5,"-","-","-","-","-","1-1/8","3-1/8",1.375,15,20,"-","-",682,1030,"N/A","N/A"]
["W4L182EHA","HIGH STATIC","WAREHOUSE","HOT GAS - REVERSE CYCLE - HOT GAS PAN",4,"THREE PHASE MOTOR","208-230/3/60",4,-20,182200,206500,"-",27500,"208-230/3/60",25.6,"-","-","-","-","-","1-1/8","3-1/8",1.375,27.2,30,"-","-",1050,1360,"N/A","N/A"]
["W4L182ETA","STANDARD","WAREHOUSE","HOT GAS - REVERSE CYCLE - HOT GAS PAN",4,"THREE PHASE MOTOR","208-230/3/60",4,-20,182200,206500,"-",27500,"208-230/3/60",16.399999999999999,"-","-","-","-","-","1-1/8","3-1/8",1.375,17.399999999999999,20,"-","-",1050,1360,"N/A","N/A"]
["W4L182GHA","HIGH STATIC","WAREHOUSE","HOT GAS - REVERSE CYCLE - HOT GAS PAN",4,"THREE PHASE MOTOR","460/3/60",4,-20,182200,206500,"-",27500,"460/3/60",12.8,"-","-","-","-","-","1-1/8","3-1/8",1.375,15,20,"-","-",1050,1360,"N/A","N/A"]
["W4L182GTA","STANDARD","WAREHOUSE","HOT GAS - REVERSE CYCLE - HOT GAS PAN",4,"THREE PHASE MOTOR","460/3/60",4,-20,182200,206500,"-",27500,"460/3/60",8,"-","-","-","-","-","1-1/8","3-1/8",1.375,15,20,"-","-",1050,1360,"N/A","N/A"]
["W4L182JHA","HIGH STATIC","WAREHOUSE","HOT GAS - REVERSE CYCLE - HOT GAS PAN",4,"THREE PHASE MOTOR","575/3/60",4,-20,182200,206500,null,27500,"575/3/60",12,"-","-","-","-","-","1-1/8","3-1/8",1.375,15,20,"-","-",1050,1360,"N/A","N/A"]
["W4L182JTA","STANDARD","WAREHOUSE","HOT GAS - REVERSE CYCLE - HOT GAS PAN",4,"THREE PHASE MOTOR","575/3/60",4,-20,182200,206500,"-",27500,"575/3/60",10,"-","-","-","-","-","1-1/8","3-1/8",1.375,15,20,"-","-",1050,1360,"N/A","N/A"]
["W4T038EHA","HIGH STATIC","WAREHOUSE","THERMOBANK",1,"THREE PHASE MOTOR","208-230/3/60",4,-20,38300,43600,"-",7010,"208-230/3/60",6.4,"-","-","-","-","-","1/2","2-1/8",1.125,15,20,"-","-",303,480,"N/A","N/A"]
["W4T038EHA","HIGH STATIC","WAREHOUSE","THERMOBANK",1,"THREE PHASE MOTOR","208-230/3/60",4,-20,38300,43600,"-",7010,"208-230/3/60",6.4,"-","-","-","-","-","1/2","2-1/8",1.125,15,20,"-","-",303,480,"N/A","N/A"]
["W4T038ETA","STANDARD","WAREHOUSE","THERMOBANK",1,"THREE PHASE MOTOR","208-230/3/60",4,-20,38300,43600,"-",7010,"208-230/3/60",4.0999999999999996,"-","-","-","-","-","1/2","2-1/8",1.125,15,20,"-","-",303,480,"N/A","N/A"]
["W4T038ETA","STANDARD","WAREHOUSE","THERMOBANK",1,"THREE PHASE MOTOR","208-230/3/60",4,-20,38300,43600,"-",7010,"208-230/3/60",4.0999999999999996,"-","-","-","-","-","1/2","2-1/8",1.125,15,20,"-","-",303,480,"N/A","N/A"]
["W4T038GHA","HIGH STATIC","WAREHOUSE","THERMOBANK",1,"THREE PHASE MOTOR","460/3/60",4,-20,38300,43600,"-",7010,"460/3/60",3.2,"-","-","-","-","-","1/2","2-1/8",1.125,15,20,"-","-",303,480,"N/A","N/A"]
["W4T038GHA","HIGH STATIC","WAREHOUSE","THERMOBANK",1,"THREE PHASE MOTOR","460/3/60",4,-20,38300,43600,"-",7010,"460/3/60",3.2,"-","-","-","-","-","1/2","2-1/8",1.125,15,20,"-","-",303,480,"N/A","N/A"]
["W4T038GTA","STANDARD","WAREHOUSE","THERMOBANK",1,"THREE PHASE MOTOR","460/3/60",4,-20,38300,43600,"-",7010,"460/3/60",2,"-","-","-","-","-","1/2","2-1/8",1.125,15,20,"-","-",303,480,"N/A","N/A"]
["W4T038GTA","STANDARD","WAREHOUSE","THERMOBANK",1,"THREE PHASE MOTOR","460/3/60",4,-20,38300,43600,"-",7010,"460/3/60",2,"-","-","-","-","-","1/2","2-1/8",1.125,15,20,"-","-",303,480,"N/A","N/A"]
["W4T038JHA","HIGH STATIC","WAREHOUSE","THERMOBANK",1,"THREE PHASE MOTOR","575/3/60",4,-20,38300,43600,"-",7010,"575/3/60",3,"-","-","-","-","-","1/2","2-1/8",1.125,15,20,"-","-",303,480,"N/A","N/A"]
["W4T038JHA","HIGH STATIC","WAREHOUSE","THERMOBANK",1,"THREE PHASE MOTOR","575/3/60",4,-20,38300,43600,"-",7010,"575/3/60",3,"-","-","-","-","-","1/2","2-1/8",1.125,15,20,"-","-",303,480,"N/A","N/A"]
["W4T038JTA","STANDARD","WAREHOUSE","THERMOBANK",1,"THREE PHASE MOTOR","575/3/60",4,-20,38300,43600,"-",7010,"575/3/60",2.5,"-","-","-","-","-","1/2","2-1/8",1.125,15,20,"-","-",303,480,"N/A","N/A"]
["W4T038JTA","STANDARD","WAREHOUSE","THERMOBANK",1,"THREE PHASE MOTOR","575/3/60",4,-20,38300,43600,"-",7010,"575/3/60",2.5,"-","-","-","-","-","1/2","2-1/8",1.125,15,20,"-","-",303,480,"N/A","N/A"]
["W4T048EHA","HIGH STATIC","WAREHOUSE","THERMOBANK",1,"THREE PHASE MOTOR","208-230/3/60",4,-20,48900,56000,"-",6875,"208-230/3/60",6.4,"-","-","-","-","-","5/8","2-1/8",1.125,15,20,"-","-",303,480,"N/A","N/A"]
["W4T048EHA","HIGH STATIC","WAREHOUSE","THERMOBANK",1,"THREE PHASE MOTOR","208-230/3/60",4,-20,48900,56000,"-",6875,"208-230/3/60",6.4,"-","-","-","-","-","5/8","2-1/8",1.125,15,20,"-","-",303,480,"N/A","N/A"]
["W4T048ETA","STANDARD","WAREHOUSE","THERMOBANK",1,"THREE PHASE MOTOR","208-230/3/60",4,-20,48900,56000,"-",6875,"208-230/3/60",4.0999999999999996,"-","-","-","-","-","5/8","2-1/8",1.125,15,20,"-","-",303,480,"N/A","N/A"]
["W4T048ETA","STANDARD","WAREHOUSE","THERMOBANK",1,"THREE PHASE MOTOR","208-230/3/60",4,-20,48900,56000,"-",6875,"208-230/3/60",4.0999999999999996,"-","-","-","-","-","5/8","2-1/8",1.125,15,20,"-","-",303,480,"N/A","N/A"]
["W4T048GHA","HIGH STATIC","WAREHOUSE","THERMOBANK",1,"THREE PHASE MOTOR","460/3/60",4,-20,48900,56000,"-",6875,"460/3/60",3.2,"-","-","-","-","-","5/8","2-1/8",1.125,15,20,"-","-",303,480,"N/A","N/A"]
["W4T048GHA","HIGH STATIC","WAREHOUSE","THERMOBANK",1,"THREE PHASE MOTOR","460/3/60",4,-20,48900,56000,"-",6875,"460/3/60",3.2,"-","-","-","-","-","5/8","2-1/8",1.125,15,20,"-","-",303,480,"N/A","N/A"]
["W4T048GTA","STANDARD","WAREHOUSE","THERMOBANK",1,"THREE PHASE MOTOR","460/3/60",4,-20,48900,56000,"-",6875,"460/3/60",2,"-","-","-","-","-","5/8","2-1/8",1.125,15,20,"-","-",303,480,"N/A","N/A"]
["W4T048GTA","STANDARD","WAREHOUSE","THERMOBANK",1,"THREE PHASE MOTOR","460/3/60",4,-20,48900,56000,"-",6875,"460/3/60",2,"-","-","-","-","-","5/8","2-1/8",1.125,15,20,"-","-",303,480,"N/A","N/A"]
["W4T048JHA","HIGH STATIC","WAREHOUSE","THERMOBANK",1,"THREE PHASE MOTOR","575/3/60",4,-20,48900,56000,null,6875,"575/3/60",3,"-","-","-","-","-","5/8","2-1/8",1.125,15,20,"-","-",303,480,"N/A","N/A"]
["W4T048JHA","HIGH STATIC","WAREHOUSE","THERMOBANK",1,"THREE PHASE MOTOR","575/3/60",4,-20,48900,56000,null,6875,"575/3/60",3,"-","-","-","-","-","5/8","2-1/8",1.125,15,20,"-","-",303,480,"N/A","N/A"]
["W4T048JTA","STANDARD","WAREHOUSE","THERMOBANK",1,"THREE PHASE MOTOR","575/3/60",4,-20,48900,56000,"-",6875,"575/3/60",2.5,"-","-","-","-","-","5/8","2-1/8",1.125,15,20,"-","-",303,480,"N/A","N/A"]
["W4T048JTA","STANDARD","WAREHOUSE","THERMOBANK",1,"THREE PHASE MOTOR","575/3/60",4,-20,48900,56000,"-",6875,"575/3/60",2.5,"-","-","-","-","-","5/8","2-1/8",1.125,15,20,"-","-",303,480,"N/A","N/A"]
["W4T077EHA","HIGH STATIC","WAREHOUSE","THERMOBANK",2,"THREE PHASE MOTOR","208-230/3/60",4,-20,77300,88600,"-",14030,"208-230/3/60",12.8,"-","-","-","-","-","5/8","2-1/8",1.125,15,20,"-","-",509,750,"N/A","N/A"]
["W4T077EHA","HIGH STATIC","WAREHOUSE","THERMOBANK",2,"THREE PHASE MOTOR","208-230/3/60",4,-20,77300,88600,"-",14030,"208-230/3/60",12.8,"-","-","-","-","-","5/8","2-1/8",1.125,15,20,"-","-",509,750,"N/A","N/A"]
["W4T077ETA","STANDARD","WAREHOUSE","THERMOBANK",2,"THREE PHASE MOTOR","208-230/3/60",4,-20,77300,88600,"-",14030,"208-230/3/60",8.1999999999999993,"-","-","-","-","-","5/8","2-1/8",1.125,15,20,"-","-",509,750,"N/A","N/A"]
["W4T077ETA","STANDARD","WAREHOUSE","THERMOBANK",2,"THREE PHASE MOTOR","208-230/3/60",4,-20,77300,88600,"-",14030,"208-230/3/60",8.1999999999999993,"-","-","-","-","-","5/8","2-1/8",1.125,15,20,"-","-",509,750,"N/A","N/A"]
["W4T077GHA","HIGH STATIC","WAREHOUSE","THERMOBANK",2,"THREE PHASE MOTOR","460/3/60",4,-20,77300,88600,"-",14030,"460/3/60",6.4,"-","-","-","-","-","5/8","2-1/8",1.125,15,20,"-","-",509,750,"N/A","N/A"]
["W4T077GHA","HIGH STATIC","WAREHOUSE","THERMOBANK",2,"THREE PHASE MOTOR","460/3/60",4,-20,77300,88600,"-",14030,"460/3/60",6.4,"-","-","-","-","-","5/8","2-1/8",1.125,15,20,"-","-",509,750,"N/A","N/A"]
["W4T077GTA","STANDARD","WAREHOUSE","THERMOBANK",2,"THREE PHASE MOTOR","460/3/60",4,-20,77300,88600,"-",14030,"460/3/60",4,"-","-","-","-","-","5/8","2-1/8",1.125,15,20,"-","-",509,750,"N/A","N/A"]
["W4T077GTA","STANDARD","WAREHOUSE","THERMOBANK",2,"THREE PHASE MOTOR","460/3/60",4,-20,77300,88600,"-",14030,"460/3/60",4,"-","-","-","-","-","5/8","2-1/8",1.125,15,20,"-","-",509,750,"N/A","N/A"]
["W4T077JHA","HIGH STATIC","WAREHOUSE","THERMOBANK",2,"THREE PHASE MOTOR","575/3/60",4,-20,77300,88600,null,14030,"575/3/60",6,"-","-","-","-","-","5/8","2-1/8",1.125,15,20,"-","-",509,750,"N/A","N/A"]
["W4T077JHA","HIGH STATIC","WAREHOUSE","THERMOBANK",2,"THREE PHASE MOTOR","575/3/60",4,-20,77300,88600,null,14030,"575/3/60",6,"-","-","-","-","-","5/8","2-1/8",1.125,15,20,"-","-",509,750,"N/A","N/A"]
["W4T077JTA","STANDARD","WAREHOUSE","THERMOBANK",2,"THREE PHASE MOTOR","575/3/60",4,-20,77300,88600,"-",14030,"575/3/60",5,"-","-","-","-","-","5/8","2-1/8",1.125,15,20,"-","-",509,750,"N/A","N/A"]
["W4T077JTA","STANDARD","WAREHOUSE","THERMOBANK",2,"THREE PHASE MOTOR","575/3/60",4,-20,77300,88600,"-",14030,"575/3/60",5,"-","-","-","-","-","5/8","2-1/8",1.125,15,20,"-","-",509,750,"N/A","N/A"]
["W4T097EHA","HIGH STATIC","WAREHOUSE","THERMOBANK",2,"THREE PHASE MOTOR","208-230/3/60",4,-20,97000,111000,"-",13750,"208-230/3/60",12.8,"-","-","-","-","-","7/8","3-1/8",1.125,15,20,"-","-",509,750,"N/A","N/A"]
["W4T097EHA","HIGH STATIC","WAREHOUSE","THERMOBANK",2,"THREE PHASE MOTOR","208-230/3/60",4,-20,97000,111000,"-",13750,"208-230/3/60",12.8,"-","-","-","-","-","7/8","3-1/8",1.125,15,20,"-","-",509,750,"N/A","N/A"]
["W4T097ETA","STANDARD","WAREHOUSE","THERMOBANK",2,"THREE PHASE MOTOR","208-230/3/60",4,-20,97000,111000,"-",13750,"208-230/3/60",8.1999999999999993,"-","-","-","-","-","7/8","3-1/8",1.125,15,20,"-","-",509,750,"N/A","N/A"]
["W4T097ETA","STANDARD","WAREHOUSE","THERMOBANK",2,"THREE PHASE MOTOR","208-230/3/60",4,-20,97000,111000,"-",13750,"208-230/3/60",8.1999999999999993,"-","-","-","-","-","7/8","3-1/8",1.125,15,20,"-","-",509,750,"N/A","N/A"]
["W4T097GHA","HIGH STATIC","WAREHOUSE","THERMOBANK",2,"THREE PHASE MOTOR","460/3/60",4,-20,97000,111000,"-",13750,"460/3/60",6.4,"-","-","-","-","-","7/8","3-1/8",1.125,15,20,"-","-",509,750,"N/A","N/A"]
["W4T097GHA","HIGH STATIC","WAREHOUSE","THERMOBANK",2,"THREE PHASE MOTOR","460/3/60",4,-20,97000,111000,"-",13750,"460/3/60",6.4,"-","-","-","-","-","7/8","3-1/8",1.125,15,20,"-","-",509,750,"N/A","N/A"]
["W4T097GTA","STANDARD","WAREHOUSE","THERMOBANK",2,"THREE PHASE MOTOR","460/3/60",4,-20,97000,111000,"-",13750,"460/3/60",4,"-","-","-","-","-","7/8","3-1/8",1.125,15,20,"-","-",509,750,"N/A","N/A"]
["W4T097GTA","STANDARD","WAREHOUSE","THERMOBANK",2,"THREE PHASE MOTOR","460/3/60",4,-20,97000,111000,"-",13750,"460/3/60",4,"-","-","-","-","-","7/8","3-1/8",1.125,15,20,"-","-",509,750,"N/A","N/A"]
["W4T097JHA","HIGH STATIC","WAREHOUSE","THERMOBANK",2,"THREE PHASE MOTOR","575/3/60",4,-20,97000,111000,null,13750,"575/3/60",6,"-","-","-","-","-","7/8","3-1/8",1.125,15,20,"-","-",509,750,"N/A","N/A"]
["W4T097JHA","HIGH STATIC","WAREHOUSE","THERMOBANK",2,"THREE PHASE MOTOR","575/3/60",4,-20,97000,111000,null,13750,"575/3/60",6,"-","-","-","-","-","7/8","3-1/8",1.125,15,20,"-","-",509,750,"N/A","N/A"]
["W4T097JTA","STANDARD","WAREHOUSE","THERMOBANK",2,"THREE PHASE MOTOR","575/3/60",4,-20,97000,111000,"-",13750,"575/3/60",5,"-","-","-","-","-","7/8","3-1/8",1.125,15,20,"-","-",509,750,"N/A","N/A"]
["W4T097JTA","STANDARD","WAREHOUSE","THERMOBANK",2,"THREE PHASE MOTOR","575/3/60",4,-20,97000,111000,"-",13750,"575/3/60",5,"-","-","-","-","-","7/8","3-1/8",1.125,15,20,"-","-",509,750,"N/A","N/A"]
["W4T115EHA","HIGH STATIC","WAREHOUSE","THERMOBANK",3,"THREE PHASE MOTOR","208-230/3/60",4,-20,115600,131200,"-",21040,"208-230/3/60",19.2,"-","-","-","-","-","7/8","3-1/8",1.375,20.8,25,"-","-",682,1030,"N/A","N/A"]
["W4T115EHA","HIGH STATIC","WAREHOUSE","THERMOBANK",3,"THREE PHASE MOTOR","208-230/3/60",4,-20,115600,131200,"-",21040,"208-230/3/60",19.2,"-","-","-","-","-","7/8","3-1/8",1.375,20.8,25,"-","-",682,1030,"N/A","N/A"]
["W4T115ETA","STANDARD","WAREHOUSE","THERMOBANK",3,"THREE PHASE MOTOR","208-230/3/60",4,-20,115600,131200,"-",21040,"208-230/3/60",12.3,"-","-","-","-","-","7/8","3-1/8",1.375,15,20,"-","-",682,1030,"N/A","N/A"]
["W4T115ETA","STANDARD","WAREHOUSE","THERMOBANK",3,"THREE PHASE MOTOR","208-230/3/60",4,-20,115600,131200,"-",21040,"208-230/3/60",12.3,"-","-","-","-","-","7/8","3-1/8",1.375,15,20,"-","-",682,1030,"N/A","N/A"]
["W4T115GHA","HIGH STATIC","WAREHOUSE","THERMOBANK",3,"THREE PHASE MOTOR","460/3/60",4,-20,115600,131200,"-",21040,"460/3/60",9.6,"-","-","-","-","-","7/8","3-1/8",1.375,15,20,"-","-",682,1030,"N/A","N/A"]
["W4T115GHA","HIGH STATIC","WAREHOUSE","THERMOBANK",3,"THREE PHASE MOTOR","460/3/60",4,-20,115600,131200,"-",21040,"460/3/60",9.6,"-","-","-","-","-","7/8","3-1/8",1.375,15,20,"-","-",682,1030,"N/A","N/A"]
["W4T115GTA","STANDARD","WAREHOUSE","THERMOBANK",3,"THREE PHASE MOTOR","460/3/60",4,-20,115600,131200,"-",21040,"460/3/60",6,"-","-","-","-","-","7/8","3-1/8",1.375,15,20,"-","-",682,1030,"N/A","N/A"]
["W4T115GTA","STANDARD","WAREHOUSE","THERMOBANK",3,"THREE PHASE MOTOR","460/3/60",4,-20,115600,131200,"-",21040,"460/3/60",6,"-","-","-","-","-","7/8","3-1/8",1.375,15,20,"-","-",682,1030,"N/A","N/A"]
["W4T115JHA","HIGH STATIC","WAREHOUSE","THERMOBANK",3,"THREE PHASE MOTOR","575/3/60",4,-20,115600,131200,null,21040,"575/3/60",9,"-","-","-","-","-","7/8","3-1/8",1.375,15,20,"-","-",682,1030,"N/A","N/A"]
["W4T115JHA","HIGH STATIC","WAREHOUSE","THERMOBANK",3,"THREE PHASE MOTOR","575/3/60",4,-20,115600,131200,null,21040,"575/3/60",9,"-","-","-","-","-","7/8","3-1/8",1.375,15,20,"-","-",682,1030,"N/A","N/A"]
["W4T115JTA","STANDARD","WAREHOUSE","THERMOBANK",3,"THREE PHASE MOTOR","575/3/60",4,-20,115600,131200,"-",21040,"575/3/60",7.5,"-","-","-","-","-","7/8","3-1/8",1.375,15,20,"-","-",682,1030,"N/A","N/A"]
["W4T115JTA","STANDARD","WAREHOUSE","THERMOBANK",3,"THREE PHASE MOTOR","575/3/60",4,-20,115600,131200,"-",21040,"575/3/60",7.5,"-","-","-","-","-","7/8","3-1/8",1.375,15,20,"-","-",682,1030,"N/A","N/A"]
["W4T145EHA","HIGH STATIC","WAREHOUSE","THERMOBANK",3,"THREE PHASE MOTOR","208-230/3/60",4,-20,145700,166400,"-",20625,"208-230/3/60",19.2,"-","-","-","-","-","1-1/8","3-1/8",1.375,20.8,25,"-","-",682,1030,"N/A","N/A"]
["W4T145EHA","HIGH STATIC","WAREHOUSE","THERMOBANK",3,"THREE PHASE MOTOR","208-230/3/60",4,-20,145700,166400,"-",20625,"208-230/3/60",19.2,"-","-","-","-","-","1-1/8","3-1/8",1.375,20.8,25,"-","-",682,1030,"N/A","N/A"]
["W4T145ETA","STANDARD","WAREHOUSE","THERMOBANK",3,"THREE PHASE MOTOR","208-230/3/60",4,-20,145700,166400,"-",20625,"208-230/3/60",12.3,"-","-","-","-","-","1-1/8","3-1/8",1.375,15,20,"-","-",682,1030,"N/A","N/A"]
["W4T145ETA","STANDARD","WAREHOUSE","THERMOBANK",3,"THREE PHASE MOTOR","208-230/3/60",4,-20,145700,166400,"-",20625,"208-230/3/60",12.3,"-","-","-","-","-","1-1/8","3-1/8",1.375,15,20,"-","-",682,1030,"N/A","N/A"]
["W4T145GHA","HIGH STATIC","WAREHOUSE","THERMOBANK",3,"THREE PHASE MOTOR","460/3/60",4,-20,145700,166400,"-",20625,"460/3/60",9.6,"-","-","-","-","-","1-1/8","3-1/8",1.375,15,20,"-","-",682,1030,"N/A","N/A"]
["W4T145GHA","HIGH STATIC","WAREHOUSE","THERMOBANK",3,"THREE PHASE MOTOR","460/3/60",4,-20,145700,166400,"-",20625,"460/3/60",9.6,"-","-","-","-","-","1-1/8","3-1/8",1.375,15,20,"-","-",682,1030,"N/A","N/A"]
["W4T145GTA","STANDARD","WAREHOUSE","THERMOBANK",3,"THREE PHASE MOTOR","460/3/60",4,-20,145700,166400,"-",20625,"460/3/60",6,"-","-","-","-","-","1-1/8","3-1/8",1.375,15,20,"-","-",682,1030,"N/A","N/A"]
["W4T145GTA","STANDARD","WAREHOUSE","THERMOBANK",3,"THREE PHASE MOTOR","460/3/60",4,-20,145700,166400,"-",20625,"460/3/60",6,"-","-","-","-","-","1-1/8","3-1/8",1.375,15,20,"-","-",682,1030,"N/A","N/A"]
["W4T145JHA","HIGH STATIC","WAREHOUSE","THERMOBANK",3,"THREE PHASE MOTOR","575/3/60",4,-20,145700,166400,null,20625,"575/3/60",9,"-","-","-","-","-","1-1/8","3-1/8",1.375,15,20,"-","-",682,1030,"N/A","N/A"]
["W4T145JHA","HIGH STATIC","WAREHOUSE","THERMOBANK",3,"THREE PHASE MOTOR","575/3/60",4,-20,145700,166400,null,20625,"575/3/60",9,"-","-","-","-","-","1-1/8","3-1/8",1.375,15,20,"-","-",682,1030,"N/A","N/A"]
["W4T145JTA","STANDARD","WAREHOUSE","THERMOBANK",3,"THREE PHASE MOTOR","575/3/60",4,-20,145700,166400,"-",20625,"575/3/60",7.5,"-","-","-","-","-","1-1/8","3-1/8",1.375,15,20,"-","-",682,1030,"N/A","N/A"]
["W4T145JTA","STANDARD","WAREHOUSE","THERMOBANK",3,"THREE PHASE MOTOR","575/3/60",4,-20,145700,166400,"-",20625,"575/3/60",7.5,"-","-","-","-","-","1-1/8","3-1/8",1.375,15,20,"-","-",682,1030,"N/A","N/A"]
["W4T182EHA","HIGH STATIC","WAREHOUSE","THERMOBANK",4,"THREE PHASE MOTOR","208-230/3/60",4,-20,182200,206500,"-",27500,"208-230/3/60",25.6,"-","-","-","-","-","1-1/8","3-1/8",1.375,27.2,30,"-","-",1050,1360,"N/A","N/A"]
["W4T182EHA","HIGH STATIC","WAREHOUSE","THERMOBANK",4,"THREE PHASE MOTOR","208-230/3/60",4,-20,182200,206500,"-",27500,"208-230/3/60",25.6,"-","-","-","-","-","1-1/8","3-1/8",1.375,27.2,30,"-","-",1050,1360,"N/A","N/A"]
["W4T182ETA","STANDARD","WAREHOUSE","THERMOBANK",4,"THREE PHASE MOTOR","208-230/3/60",4,-20,182200,206500,"-",27500,"208-230/3/60",16.399999999999999,"-","-","-","-","-","1-1/8","3-1/8",1.375,17.399999999999999,20,"-","-",1050,1360,"N/A","N/A"]
["W4T182ETA","STANDARD","WAREHOUSE","THERMOBANK",4,"THREE PHASE MOTOR","208-230/3/60",4,-20,182200,206500,"-",27500,"208-230/3/60",16.399999999999999,"-","-","-","-","-","1-1/8","3-1/8",1.375,17.399999999999999,20,"-","-",1050,1360,"N/A","N/A"]
["W4T182GHA","HIGH STATIC","WAREHOUSE","THERMOBANK",4,"THREE PHASE MOTOR","460/3/60",4,-20,182200,206500,"-",27500,"460/3/60",12.8,"-","-","-","-","-","1-1/8","3-1/8",1.375,15,20,"-","-",1050,1360,"N/A","N/A"]
["W4T182GHA","HIGH STATIC","WAREHOUSE","THERMOBANK",4,"THREE PHASE MOTOR","460/3/60",4,-20,182200,206500,"-",27500,"460/3/60",12.8,"-","-","-","-","-","1-1/8","3-1/8",1.375,15,20,"-","-",1050,1360,"N/A","N/A"]
["W4T182GTA","STANDARD","WAREHOUSE","THERMOBANK",4,"THREE PHASE MOTOR","460/3/60",4,-20,182200,206500,"-",27500,"460/3/60",8,"-","-","-","-","-","1-1/8","3-1/8",1.375,15,20,"-","-",1050,1360,"N/A","N/A"]
["W4T182GTA","STANDARD","WAREHOUSE","THERMOBANK",4,"THREE PHASE MOTOR","460/3/60",4,-20,182200,206500,"-",27500,"460/3/60",8,"-","-","-","-","-","1-1/8","3-1/8",1.375,15,20,"-","-",1050,1360,"N/A","N/A"]
["W4T182JHA","HIGH STATIC","WAREHOUSE","THERMOBANK",4,"THREE PHASE MOTOR","575/3/60",4,-20,182200,206500,null,27500,"575/3/60",12,"-","-","-","-","-","1-1/8","3-1/8",1.375,15,20,"-","-",1050,1360,"N/A","N/A"]
["W4T182JHA","HIGH STATIC","WAREHOUSE","THERMOBANK",4,"THREE PHASE MOTOR","575/3/60",4,-20,182200,206500,null,27500,"575/3/60",12,"-","-","-","-","-","1-1/8","3-1/8",1.375,15,20,"-","-",1050,1360,"N/A","N/A"]
["W4T182JTA","STANDARD","WAREHOUSE","THERMOBANK",4,"THREE PHASE MOTOR","575/3/60",4,-20,182200,206500,"-",27500,"575/3/60",10,"-","-","-","-","-","1-1/8","3-1/8",1.375,15,20,"-","-",1050,1360,"N/A","N/A"]
["W4T182JTA","STANDARD","WAREHOUSE","THERMOBANK",4,"THREE PHASE MOTOR","575/3/60",4,-20,182200,206500,"-",27500,"575/3/60",10,"-","-","-","-","-","1-1/8","3-1/8",1.375,15,20,"-","-",1050,1360,"N/A","N/A"]
["W6A034EHA","HIGH STATIC","WAREHOUSE","AIR DEFROST",1,"THREE PHASE MOTOR","208-230/3/60",6,25,34500,40400,"-",7080,"208-230/3/60",6.4,"-","-","-","-","-","1/2","1-1/8","-",15,20,15,20,303,480,"N/A","N/A"]
["W6A034ETA","STANDARD","WAREHOUSE","AIR DEFROST",1,"THREE PHASE MOTOR","208-230/3/60",6,25,34500,40400,"-",7080,"208-230/3/60",4.0999999999999996,"-","-","-","-","-","1/2","1-1/8","-",15,20,15,20,303,480,"N/A","N/A"]
["W6A034GHA","HIGH STATIC","WAREHOUSE","AIR DEFROST",1,"THREE PHASE MOTOR","460/3/60",6,25,34500,40400,"-",7080,"460/3/60",3.2,"-","-","-","-","-","1/2","1-1/8","-",15,20,15,20,303,480,"N/A","N/A"]
["W6A034GTA","STANDARD","WAREHOUSE","AIR DEFROST",1,"THREE PHASE MOTOR","460/3/60",6,25,34500,40400,"-",7080,"460/3/60",2,"-","-","-","-","-","1/2","1-1/8","-",15,20,15,20,303,480,"N/A","N/A"]
["W6A034JHA","HIGH STATIC","WAREHOUSE","AIR DEFROST",1,"THREE PHASE MOTOR","575/3/60",6,25,34500,40400,"-",7080,"575/3/60",3,"-","-","-","-","-","1/2","1-1/8","-",15,20,15,20,303,480,"N/A","N/A"]
["W6A034JTA","STANDARD","WAREHOUSE","AIR DEFROST",1,"THREE PHASE MOTOR","575/3/60",6,25,34500,40400,"-",7080,"575/3/60",2.5,"-","-","-","-","-","1/2","1-1/8","-",15,20,15,20,303,480,"N/A","N/A"]
["W6A047EHA","HIGH STATIC","WAREHOUSE","AIR DEFROST",1,"THREE PHASE MOTOR","208-230/3/60",6,25,47000,55000,"-",7010,"208-230/3/60",6.4,"-","-","-","-","-","1/2","1-3/8","-",15,20,15,20,303,480,"N/A","N/A"]
["W6A047ETA","STANDARD","WAREHOUSE","AIR DEFROST",1,"THREE PHASE MOTOR","208-230/3/60",6,25,47000,55000,"-",7010,"208-230/3/60",4.0999999999999996,"-","-","-","-","-","1/2","1-3/8","-",15,20,15,20,303,480,"N/A","N/A"]
["W6A047GHA","HIGH STATIC","WAREHOUSE","AIR DEFROST",1,"THREE PHASE MOTOR","460/3/60",6,25,47000,55000,"-",7010,"460/3/60",3.2,"-","-","-","-","-","1/2","1-3/8","-",15,20,15,20,303,480,"N/A","N/A"]
["W6A047GTA","STANDARD","WAREHOUSE","AIR DEFROST",1,"THREE PHASE MOTOR","460/3/60",6,25,47000,55000,"-",7010,"460/3/60",2,"-","-","-","-","-","1/2","1-3/8","-",15,20,15,20,303,480,"N/A","N/A"]
["W6A047JHA","HIGH STATIC","WAREHOUSE","AIR DEFROST",1,"THREE PHASE MOTOR","575/3/60",6,25,47000,55000,"-",7010,"575/3/60",3,"-","-","-","-","-","1/2","1-3/8","-",15,20,15,20,303,480,"N/A","N/A"]
["W6A047JTA","STANDARD","WAREHOUSE","AIR DEFROST",1,"THREE PHASE MOTOR","575/3/60",6,25,47000,55000,"-",7010,"575/3/60",2.5,"-","-","-","-","-","1/2","1-3/8","-",15,20,15,20,303,480,"N/A","N/A"]
["W6A058EHA","HIGH STATIC","WAREHOUSE","AIR DEFROST",1,"THREE PHASE MOTOR","208-230/3/60",6,25,58200,68900,"-",6875,"208-230/3/60",6.4,"-","-","-","-","-","5/8","1-5/8","-",15,20,15,20,303,480,"N/A","N/A"]
["W6A058ETA","STANDARD","WAREHOUSE","AIR DEFROST",1,"THREE PHASE MOTOR","208-230/3/60",6,25,58200,68900,"-",6875,"208-230/3/60",4.0999999999999996,"-","-","-","-","-","5/8","1-5/8","-",15,20,15,20,303,480,"N/A","N/A"]
["W6A058GHA","HIGH STATIC","WAREHOUSE","AIR DEFROST",1,"THREE PHASE MOTOR","460/3/60",6,25,58200,68900,"-",6875,"460/3/60",3.2,"-","-","-","-","-","5/8","1-5/8","-",15,20,15,20,303,480,"N/A","N/A"]
["W6A058GTA","STANDARD","WAREHOUSE","AIR DEFROST",1,"THREE PHASE MOTOR","460/3/60",6,25,58200,68900,"-",6875,"460/3/60",2,"-","-","-","-","-","5/8","1-5/8","-",15,20,15,20,303,480,"N/A","N/A"]
["W6A058JHA","HIGH STATIC","WAREHOUSE","AIR DEFROST",1,"THREE PHASE MOTOR","575/3/60",6,25,58200,68900,"-",6875,"575/3/60",3,"-","-","-","-","-","5/8","1-5/8","-",15,20,15,20,303,480,"N/A","N/A"]
["W6A058JTA","STANDARD","WAREHOUSE","AIR DEFROST",1,"THREE PHASE MOTOR","575/3/60",6,25,58200,68900,"-",6875,"575/3/60",2.5,"-","-","-","-","-","5/8","1-5/8","-",15,20,15,20,303,480,"N/A","N/A"]
["W6A069EHA","HIGH STATIC","WAREHOUSE","AIR DEFROST",2,"THREE PHASE MOTOR","208-230/3/60",6,25,69600,80900,"-",14160,"208-230/3/60",12.8,"-","-","-","-","-","5/8","1-5/8","-",15,20,16.399999999999999,20,509,750,"N/A","N/A"]
["W6A069ETA","STANDARD","WAREHOUSE","AIR DEFROST",2,"THREE PHASE MOTOR","208-230/3/60",6,25,69600,80900,"-",14160,"208-230/3/60",8.1999999999999993,"-","-","-","-","-","5/8","1-5/8","-",15,20,15,20,509,750,"N/A","N/A"]
["W6A069GHA","HIGH STATIC","WAREHOUSE","AIR DEFROST",2,"THREE PHASE MOTOR","460/3/60",6,25,69600,80900,"-",14160,"460/3/60",6.4,"-","-","-","-","-","5/8","1-5/8","-",15,20,15,20,509,750,"N/A","N/A"]
["W6A069GTA","STANDARD","WAREHOUSE","AIR DEFROST",2,"THREE PHASE MOTOR","460/3/60",6,25,69600,80900,"-",14160,"460/3/60",4,"-","-","-","-","-","5/8","1-5/8","-",15,20,15,20,509,750,"N/A","N/A"]
["W6A069JHA","HIGH STATIC","WAREHOUSE","AIR DEFROST",2,"THREE PHASE MOTOR","575/3/60",6,25,69600,80900,"-",14160,"575/3/60",6,"-","-","-","-","-","5/8","1-5/8","-",15,20,15,20,509,750,"N/A","N/A"]
["W6A069JTA","STANDARD","WAREHOUSE","AIR DEFROST",2,"THREE PHASE MOTOR","575/3/60",6,25,69600,80900,"-",14160,"575/3/60",5,"-","-","-","-","-","5/8","1-5/8","-",15,20,15,20,509,750,"N/A","N/A"]
["W6A094EHA","HIGH STATIC","WAREHOUSE","AIR DEFROST",2,"THREE PHASE MOTOR","208-230/3/60",6,25,94500,111500,"-",14030,"208-230/3/60",12.8,"-","-","-","-","-","7/8","2-1/8","-",15,20,16.399999999999999,20,509,750,"N/A","N/A"]
["W6A094ETA","STANDARD","WAREHOUSE","AIR DEFROST",2,"THREE PHASE MOTOR","208-230/3/60",6,25,94500,111500,"-",14030,"208-230/3/60",8.1999999999999993,"-","-","-","-","-","7/8","2-1/8","-",15,20,15,20,509,750,"N/A","N/A"]
["W6A094GHA","HIGH STATIC","WAREHOUSE","AIR DEFROST",2,"THREE PHASE MOTOR","460/3/60",6,25,94500,111500,"-",14030,"460/3/60",6.4,"-","-","-","-","-","7/8","2-1/8","-",15,20,15,20,509,750,"N/A","N/A"]
["W6A094GTA","STANDARD","WAREHOUSE","AIR DEFROST",2,"THREE PHASE MOTOR","460/3/60",6,25,94500,111500,"-",14030,"460/3/60",4,"-","-","-","-","-","7/8","2-1/8","-",15,20,15,20,509,750,"N/A","N/A"]
["W6A094JHA","HIGH STATIC","WAREHOUSE","AIR DEFROST",2,"THREE PHASE MOTOR","575/3/60",6,25,94500,111500,"-",14030,"575/3/60",6,"-","-","-","-","-","7/8","2-1/8","-",15,20,15,20,509,750,"N/A","N/A"]
["W6A094JTA","STANDARD","WAREHOUSE","AIR DEFROST",2,"THREE PHASE MOTOR","575/3/60",6,25,94500,111500,"-",14030,"575/3/60",5,"-","-","-","-","-","7/8","2-1/8","-",15,20,15,20,509,750,"N/A","N/A"]
["W6A117EHA","HIGH STATIC","WAREHOUSE","AIR DEFROST",2,"THREE PHASE MOTOR","208-230/3/60",6,25,117200,138800,"-",13750,"208-230/3/60",12.8,"-","-","-","-","-","7/8","2-1/8","-",15,20,16.399999999999999,20,509,750,"N/A","N/A"]
["W6A117ETA","STANDARD","WAREHOUSE","AIR DEFROST",2,"THREE PHASE MOTOR","208-230/3/60",6,25,117200,138800,"-",13750,"208-230/3/60",8.1999999999999993,"-","-","-","-","-","7/8","2-1/8","-",15,20,15,20,509,750,"N/A","N/A"]
["W6A117GHA","HIGH STATIC","WAREHOUSE","AIR DEFROST",2,"THREE PHASE MOTOR","460/3/60",6,25,117200,138800,"-",13750,"460/3/60",6.4,"-","-","-","-","-","7/8","2-1/8","-",15,20,15,20,509,750,"N/A","N/A"]
["W6A117GTA","STANDARD","WAREHOUSE","AIR DEFROST",2,"THREE PHASE MOTOR","460/3/60",6,25,117200,138800,"-",13750,"460/3/60",4,"-","-","-","-","-","7/8","2-1/8","-",15,20,15,20,509,750,"N/A","N/A"]
["W6A117JHA","HIGH STATIC","WAREHOUSE","AIR DEFROST",2,"THREE PHASE MOTOR","575/3/60",6,25,117200,138800,"-",13750,"575/3/60",6,"-","-","-","-","-","7/8","2-1/8","-",15,20,15,20,509,750,"N/A","N/A"]
["W6A117JTA","STANDARD","WAREHOUSE","AIR DEFROST",2,"THREE PHASE MOTOR","575/3/60",6,25,117200,138800,"-",13750,"575/3/60",5,"-","-","-","-","-","7/8","2-1/8","-",15,20,15,20,509,750,"N/A","N/A"]
["W6A143EHA","HIGH STATIC","WAREHOUSE","AIR DEFROST",3,"THREE PHASE MOTOR","208-230/3/60",6,25,143100,167000,"-",21040,"208-230/3/60",19.2,"-","-","-","-","-","7/8","2-1/8","-",20.8,25,22.8,25,682,1030,"N/A","N/A"]
["W6A143ETA","STANDARD","WAREHOUSE","AIR DEFROST",3,"THREE PHASE MOTOR","208-230/3/60",6,25,143100,167000,"-",21040,"208-230/3/60",12.3,"-","-","-","-","-","7/8","2-1/8","-",15,20,15,20,682,1030,"N/A","N/A"]
["W6A143GHA","HIGH STATIC","WAREHOUSE","AIR DEFROST",3,"THREE PHASE MOTOR","460/3/60",6,25,143100,167000,"-",21040,"460/3/60",9.6,"-","-","-","-","-","7/8","2-1/8","-",15,20,15,20,682,1030,"N/A","N/A"]
["W6A143GTA","STANDARD","WAREHOUSE","AIR DEFROST",3,"THREE PHASE MOTOR","460/3/60",6,25,143100,167000,"-",21040,"460/3/60",6,"-","-","-","-","-","7/8","2-1/8","-",15,20,15,20,682,1030,"N/A","N/A"]
["W6A143JHA","HIGH STATIC","WAREHOUSE","AIR DEFROST",3,"THREE PHASE MOTOR","575/3/60",6,25,143100,167000,"-",21040,"575/3/60",9,"-","-","-","-","-","7/8","2-1/8","-",15,20,15,20,682,1030,"N/A","N/A"]
["W6A143JTA","STANDARD","WAREHOUSE","AIR DEFROST",3,"THREE PHASE MOTOR","575/3/60",6,25,143100,167000,"-",21040,"575/3/60",7.5,"-","-","-","-","-","7/8","2-1/8","-",15,20,15,20,682,1030,"N/A","N/A"]
["W6A176EHA","HIGH STATIC","WAREHOUSE","AIR DEFROST",3,"THREE PHASE MOTOR","208-230/3/60",6,25,176000,207500,"-",20625,"208-230/3/60",19.2,"-","-","-","-","-","1-1/8","2-1/8","-",20.8,25,22.8,25,682,1030,"N/A","N/A"]
["W6A176ETA","STANDARD","WAREHOUSE","AIR DEFROST",3,"THREE PHASE MOTOR","208-230/3/60",6,25,176000,207500,"-",20625,"208-230/3/60",12.3,"-","-","-","-","-","1-1/8","2-1/8","-",15,20,15,20,682,1030,"N/A","N/A"]
["W6A176GHA","HIGH STATIC","WAREHOUSE","AIR DEFROST",3,"THREE PHASE MOTOR","460/3/60",6,25,176000,207500,"-",20625,"460/3/60",9.6,"-","-","-","-","-","1-1/8","2-1/8","-",15,20,15,20,682,1030,"N/A","N/A"]
["W6A176GTA","STANDARD","WAREHOUSE","AIR DEFROST",3,"THREE PHASE MOTOR","460/3/60",6,25,176000,207500,"-",20625,"460/3/60",6,"-","-","-","-","-","1-1/8","2-1/8","-",15,20,15,20,682,1030,"N/A","N/A"]
["W6A176JHA","HIGH STATIC","WAREHOUSE","AIR DEFROST",3,"THREE PHASE MOTOR","575/3/60",6,25,176000,207500,"-",20625,"575/3/60",9,"-","-","-","-","-","1-1/8","2-1/8","-",15,20,15,20,682,1030,"N/A","N/A"]
["W6A176JTA","STANDARD","WAREHOUSE","AIR DEFROST",3,"THREE PHASE MOTOR","575/3/60",6,25,176000,207500,"-",20625,"575/3/60",7.5,"-","-","-","-","-","1-1/8","2-1/8","-",15,20,15,20,682,1030,"N/A","N/A"]
["W6A190EHA","HIGH STATIC","WAREHOUSE","AIR DEFROST",4,"THREE PHASE MOTOR","208-230/3/60",6,25,190100,226100,"-",28050,"208-230/3/60",25.6,"-","-","-","-","-","1-1/8","2-1/8","-",27.2,30,29.2,35,1050,1360,"N/A","N/A"]
["W6A190ETA","STANDARD","WAREHOUSE","AIR DEFROST",4,"THREE PHASE MOTOR","208-230/3/60",6,25,190100,226100,"-",28050,"208-230/3/60",16.399999999999999,"-","-","-","-","-","1-1/8","2-1/8","-",17.399999999999999,20,19.399999999999999,20,1050,1360,"N/A","N/A"]
["W6A190GHA","HIGH STATIC","WAREHOUSE","AIR DEFROST",4,"THREE PHASE MOTOR","460/3/60",6,25,190100,226100,"-",28050,"460/3/60",12.8,"-","-","-","-","-","1-1/8","2-1/8","-",15,20,15,20,1050,1360,"N/A","N/A"]
["W6A190GTA","STANDARD","WAREHOUSE","AIR DEFROST",4,"THREE PHASE MOTOR","460/3/60",6,25,190100,226100,"-",28050,"460/3/60",8,"-","-","-","-","-","1-1/8","2-1/8","-",15,20,15,20,1050,1360,"N/A","N/A"]
["W6A190JHA","HIGH STATIC","WAREHOUSE","AIR DEFROST",4,"THREE PHASE MOTOR","575/3/60",6,25,190100,226100,"-",28050,"575/3/60",12,"-","-","-","-","-","1-1/8","2-1/8","-",15,20,15,20,1050,1360,"N/A","N/A"]
["W6A190JTA","STANDARD","WAREHOUSE","AIR DEFROST",4,"THREE PHASE MOTOR","575/3/60",6,25,190100,226100,"-",28050,"575/3/60",10,"-","-","-","-","-","1-1/8","2-1/8","-",15,20,15,20,1050,1360,"N/A","N/A"]
["W6A234EHA","HIGH STATIC","WAREHOUSE","AIR DEFROST",4,"THREE PHASE MOTOR","208-230/3/60",6,25,234900,282500,"-",27500,"208-230/3/60",25.6,"-","-","-","-","-","1-1/8","2-1/8","-",27.2,30,29.2,35,1050,1360,"N/A","N/A"]
["W6A234ETA","STANDARD","WAREHOUSE","AIR DEFROST",4,"THREE PHASE MOTOR","208-230/3/60",6,25,234900,282500,"-",27500,"208-230/3/60",16.399999999999999,"-","-","-","-","-","1-1/8","2-1/8","-",17.399999999999999,20,19.399999999999999,20,1050,1360,"N/A","N/A"]
["W6A234GHA","HIGH STATIC","WAREHOUSE","AIR DEFROST",4,"THREE PHASE MOTOR","460/3/60",6,25,234900,282500,"-",27500,"460/3/60",12.8,"-","-","-","-","-","1-1/8","2-1/8","-",15,20,15,20,1050,1360,"N/A","N/A"]
["W6A234GTA","STANDARD","WAREHOUSE","AIR DEFROST",4,"THREE PHASE MOTOR","460/3/60",6,25,234900,282500,"-",27500,"460/3/60",8,"-","-","-","-","-","1-1/8","2-1/8","-",15,20,15,20,1050,1360,"N/A","N/A"]
["W6A234JHA","HIGH STATIC","WAREHOUSE","AIR DEFROST",4,"THREE PHASE MOTOR","575/3/60",6,25,234900,282500,"-",27500,"575/3/60",12,"-","-","-","-","-","1-1/8","2-1/8","-",15,20,15,20,1050,1360,"N/A","N/A"]
["W6A234JTA","STANDARD","WAREHOUSE","AIR DEFROST",4,"THREE PHASE MOTOR","575/3/60",6,25,234900,282500,"-",27500,"575/3/60",10,"-","-","-","-","-","1-1/8","2-1/8","-",15,20,15,20,1050,1360,"N/A","N/A"]
["W6D033ETA","STANDARD ","WAREHOUSE","ELECTRIC DEFROST -MEDIUM TEMP",1,"THREE-PHASE MOTOR","208-230/3/60",6,25,34500,40400,null,7080,"208-230/3/60",4.0999999999999996,"208-230/3/60",1,{"$f":"S356/Q356","v":14.4},14.4,6000,"1/2","1-1/8","-",15,20,16.399999999999999,20,303,480,"N/A","N/A"]
["W6D046ETA","STANDARD ","WAREHOUSE","ELECTRIC DEFROST -MEDIUM TEMP",1,"THREE-PHASE MOTOR","208-230/3/60",6,25,47000,55000,null,7010,"208-230/3/60",4.0999999999999996,"208-230/3/60",1,14.4,14.4,6000,"1/2","1-3/8","-",15,20,16.399999999999999,20,303,480,"N/A","N/A"]
["W6D057ETA","STANDARD ","WAREHOUSE","ELECTRIC DEFROST -MEDIUM TEMP",1,"THREE-PHASE MOTOR","208-230/3/60",6,25,58200,68900,null,6875,"208-230/3/60",4.0999999999999996,"208-230/3/60",1,14.4,14.4,6000,"5/8","1-5/8","-",15,20,16.399999999999999,20,303,480,"N/A","N/A"]
["W6D068ETA","STANDARD ","WAREHOUSE","ELECTRIC DEFROST -MEDIUM TEMP",2,"THREE-PHASE MOTOR","208-230/3/60",6,25,69600,80900,null,14160,"208-230/3/60",8.1999999999999993,"208-230/3/60",1,28.9,28.9,12000,"5/8","1-5/8","-",15,20,30.9,35,509,750,"N/A","N/A"]
["W6D093ETA","STANDARD ","WAREHOUSE","ELECTRIC DEFROST -MEDIUM TEMP",2,"THREE-PHASE MOTOR","208-230/3/60",6,25,94500,111500,null,14030,"208-230/3/60",8.1999999999999993,"208-230/3/60",1,28.9,28.9,12000,"7/8","2-1/8","-",15,20,30.9,35,509,750,"N/A","N/A"]
["W6D116ETA","STANDARD ","WAREHOUSE","ELECTRIC DEFROST -MEDIUM TEMP",2,"THREE-PHASE MOTOR","208-230/3/60",6,25,117200,138800,null,13750,"208-230/3/60",8.1999999999999993,"208-230/3/60",1,28.9,28.9,12000,"7/8","2-1/8","-",15,20,30.9,35,509,750,"N/A","N/A"]
["W6D142ETA","STANDARD ","WAREHOUSE","ELECTRIC DEFROST -MEDIUM TEMP",3,"THREE-PHASE MOTOR","208-230/3/60",6,25,143100,167000,null,21040,"208-230/3/60",12.3,"208-230/3/60",1,43.3,43.3,18000,"7/8","2-1/8","-",15,20,45.3,50,682,1030,"N/A","N/A"]
["W6D175ETA","STANDARD ","WAREHOUSE","ELECTRIC DEFROST -MEDIUM TEMP",3,"THREE-PHASE MOTOR","208-230/3/60",6,25,176000,207500,null,20625,"208-230/3/60",12.3,"208-230/3/60",1,43.3,43.3,18000,"1-1/8","2-1/8","-",15,20,45.3,50,682,1030,"N/A","N/A"]
["W6D189ETA","STANDARD ","WAREHOUSE","ELECTRIC DEFROST -MEDIUM TEMP",4,"THREE-PHASE MOTOR","208-230/3/60",6,25,190100,226100,null,27500,"208-230/3/60",16.399999999999999,"208-230/3/60",2,28.85,57.7,24000,"1-1/8","2-1/8","-",17.399999999999999,20,59.7,60,1050,1360,"N/A","N/A"]
["W6D233ETA","STANDARD ","WAREHOUSE","ELECTRIC DEFROST -MEDIUM TEMP",4,"THREE-PHASE MOTOR","208-230/3/60",6,25,234900,282500,null,27500,"208-230/3/60",16.399999999999999,"208-230/3/60",2,28.85,57.7,24000,"1-1/8","2-1/8","-",17.399999999999999,20,59.7,60,1050,1360,"N/A","N/A"]
["W6D033GTA","STANDARD ","WAREHOUSE","ELECTRIC DEFROST -MEDIUM TEMP",1,"THREE-PHASE MOTOR","460/3/60",6,25,34500,40400,null,7080,"460/3/60",2,"460/3/60",1,7.5,7.5,6000,"1/2","1-1/8","-",15,20,15,20,303,480,"N/A","N/A"]
["W6D046GTA","STANDARD ","WAREHOUSE","ELECTRIC DEFROST -MEDIUM TEMP",1,"THREE-PHASE MOTOR","460/3/60",6,25,47000,55000,null,7010,"460/3/60",2,"460/3/60",1,7.5,7.5,6000,"1/2","1-3/8","-",15,20,15,20,303,480,"N/A","N/A"]
["W6D057GTA","STANDARD ","WAREHOUSE","ELECTRIC DEFROST -MEDIUM TEMP",1,"THREE-PHASE MOTOR","460/3/60",6,25,58200,68900,null,6875,"460/3/60",2,"460/3/60",1,7.5,7.5,6000,"5/8","1-5/8","-",15,20,15,20,303,480,"N/A","N/A"]
["W6D068GTA","STANDARD ","WAREHOUSE","ELECTRIC DEFROST -MEDIUM TEMP",2,"THREE-PHASE MOTOR","460/3/60",6,25,69600,80900,null,14160,"460/3/60",4,"460/3/60",1,15.1,15.1,12000,"5/8","1-5/8","-",15,20,16.100000000000001,20,509,750,"N/A","N/A"]
["W6D093GTA","STANDARD ","WAREHOUSE","ELECTRIC DEFROST -MEDIUM TEMP",2,"THREE-PHASE MOTOR","460/3/60",6,25,94500,111500,null,14030,"460/3/60",4,"460/3/60",1,15.1,15.1,12000,"7/8","2-1/8","-",15,20,16.100000000000001,20,509,750,"N/A","N/A"]
["W6D116GTA","STANDARD ","WAREHOUSE","ELECTRIC DEFROST -MEDIUM TEMP",2,"THREE-PHASE MOTOR","460/3/60",6,25,117200,138800,null,13750,"460/3/60",4,"460/3/60",1,15.1,15.1,12000,"7/8","2-1/8","-",15,20,16.100000000000001,20,509,750,"N/A","N/A"]
["W6D142GTA","STANDARD ","WAREHOUSE","ELECTRIC DEFROST -MEDIUM TEMP",3,"THREE-PHASE MOTOR","460/3/60",6,25,143100,167000,null,21040,"460/3/60",6,"460/3/60",1,22.6,22.6,18000,"7/8","2-1/8","-",15,20,23.6,25,682,1030,"N/A","N/A"]
["W6D175GTA","STANDARD ","WAREHOUSE","ELECTRIC DEFROST -MEDIUM TEMP",3,"THREE-PHASE MOTOR","460/3/60",6,25,176000,207500,null,20625,"460/3/60",6,"460/3/60",1,22.6,22.6,18000,"1-1/8","2-1/8","-",15,20,23.6,25,682,1030,"N/A","N/A"]
["W6D189GTA","STANDARD ","WAREHOUSE","ELECTRIC DEFROST -MEDIUM TEMP",4,"THREE-PHASE MOTOR","460/3/60",6,25,190100,226100,null,27500,"460/3/60",8,"460/3/60",1,30.1,30.1,24000,"1-1/8","2-1/8","-",15,20,31.1,35,1050,1360,"N/A","N/A"]
["W6D233GTA","STANDARD ","WAREHOUSE","ELECTRIC DEFROST -MEDIUM TEMP",4,"THREE-PHASE MOTOR","460/3/60",6,25,234900,282500,null,27500,"460/3/60",8,"460/3/60",1,30.1,30.1,24000,"1-1/8","2-1/8","-",15,20,31.1,35,1050,1360,"N/A","N/A"]
["W6E036EHA","HIGH STATIC","WAREHOUSE","ELECTRIC DEFROST - LOW TEMP",1,"THREE PHASE MOTOR","208-230/3/60",6,-20,36400,41900,"-",7080,"208-230/3/60",6.4,"208-230/3/60",1,14.4,14.4,6000,"1/2","2-1/8","-",15,20,16.399999999999999,20,303,480,"N/A","N/A"]
["W6E036ETA","STANDARD","WAREHOUSE","ELECTRIC DEFROST - LOW TEMP",1,"THREE PHASE MOTOR","208-230/3/60",6,-20,36400,41900,"-",7080,"208-230/3/60",4.0999999999999996,"208-230/3/60",1,14.4,14.4,6000,"1/2","2-1/8","-",15,20,16.399999999999999,20,303,480,"N/A","N/A"]
["W6E036GHA","HIGH STATIC","WAREHOUSE","ELECTRIC DEFROST - LOW TEMP",1,"THREE PHASE MOTOR","460/3/60",6,-20,36400,41900,"-",7080,"460/3/60",3.2,"460/3/60",1,7.5,7.5,6000,"1/2","2-1/8","-",15,20,15,20,303,480,"N/A","N/A"]
["W6E036GTA","STANDARD","WAREHOUSE","ELECTRIC DEFROST - LOW TEMP",1,"THREE PHASE MOTOR","460/3/60",6,-20,36400,41900,"-",7080,"460/3/60",2,"460/3/60",1,7.5,7.5,6000,"1/2","2-1/8","-",15,20,15,20,303,480,"N/A","N/A"]
["W6E036JHA","HIGH STATIC","WAREHOUSE","ELECTRIC DEFROST - LOW TEMP",1,"THREE PHASE MOTOR","575/3/60",6,-20,36400,41900,"-",7080,"575/3/60",3,"575/3/60",1,6,6,6000,"1/2","2-1/8","-",15,20,15,20,303,480,"N/A","N/A"]
["W6E036JTA","STANDARD","WAREHOUSE","ELECTRIC DEFROST - LOW TEMP",1,"THREE PHASE MOTOR","575/3/60",6,-20,36400,41900,"-",7080,"575/3/60",2.5,"575/3/60",1,6,6,6000,"1/2","2-1/8","-",15,20,15,20,303,480,"N/A","N/A"]
["W6E047EHA","HIGH STATIC","WAREHOUSE","ELECTRIC DEFROST - LOW TEMP",1,"THREE PHASE MOTOR","208-230/3/60",6,-20,47900,54600,"-",7010,"208-230/3/60",6.4,"208-230/3/60",1,14.4,14.4,6000,"5/8","2-1/8","-",15,20,16.399999999999999,20,303,480,"N/A","N/A"]
["W6E047ETA","STANDARD","WAREHOUSE","ELECTRIC DEFROST - LOW TEMP",1,"THREE PHASE MOTOR","208-230/3/60",6,-20,47900,54600,"-",7010,"208-230/3/60",4.0999999999999996,"208-230/3/60",1,14.4,14.4,6000,"5/8","2-1/8","-",15,20,16.399999999999999,20,303,480,"N/A","N/A"]
["W6E047GHA","HIGH STATIC","WAREHOUSE","ELECTRIC DEFROST - LOW TEMP",1,"THREE PHASE MOTOR","460/3/60",6,-20,47900,54600,"-",7010,"460/3/60",3.2,"460/3/60",1,7.5,7.5,6000,"5/8","2-1/8","-",15,20,15,20,303,480,"N/A","N/A"]
["W6E047GTA","STANDARD","WAREHOUSE","ELECTRIC DEFROST - LOW TEMP",1,"THREE PHASE MOTOR","460/3/60",6,-20,47900,54600,"-",7010,"460/3/60",2,"460/3/60",1,7.5,7.5,6000,"5/8","2-1/8","-",15,20,15,20,303,480,"N/A","N/A"]
["W6E047JHA","HIGH STATIC","WAREHOUSE","ELECTRIC DEFROST - LOW TEMP",1,"THREE PHASE MOTOR","575/3/60",6,-20,47900,54600,"-",7010,"575/3/60",3,"575/3/60",1,6,6,6000,"5/8","2-1/8","-",15,20,15,20,303,480,"N/A","N/A"]
["W6E047JTA","STANDARD","WAREHOUSE","ELECTRIC DEFROST - LOW TEMP",1,"THREE PHASE MOTOR","575/3/60",6,-20,47900,54600,"-",7010,"575/3/60",2.5,"575/3/60",1,6,6,6000,"5/8","2-1/8","-",15,20,15,20,303,480,"N/A","N/A"]
["W6E059EHA","HIGH STATIC","WAREHOUSE","ELECTRIC DEFROST - LOW TEMP",1,"THREE PHASE MOTOR","208-230/3/60",6,-20,59200,67900,"-",6875,"208-230/3/60",6.4,"208-230/3/60",1,14.4,14.4,6000,"5/8","2-1/8","-",15,20,16.399999999999999,20,303,480,"N/A","N/A"]
["W6E059ETA","STANDARD","WAREHOUSE","ELECTRIC DEFROST - LOW TEMP",1,"THREE PHASE MOTOR","208-230/3/60",6,-20,59200,67900,"-",6875,"208-230/3/60",4.0999999999999996,"208-230/3/60",1,14.4,14.4,6000,"5/8","2-1/8","-",15,20,16.399999999999999,20,303,480,"N/A","N/A"]
["W6E059GHA","HIGH STATIC","WAREHOUSE","ELECTRIC DEFROST - LOW TEMP",1,"THREE PHASE MOTOR","460/3/60",6,-20,59200,67900,"-",6875,"460/3/60",3.2,"460/3/60",1,7.5,7.5,6000,"5/8","2-1/8","-",15,20,15,20,303,480,"N/A","N/A"]
["W6E059GTA","STANDARD","WAREHOUSE","ELECTRIC DEFROST - LOW TEMP",1,"THREE PHASE MOTOR","460/3/60",6,-20,59200,67900,"-",6875,"460/3/60",2,"460/3/60",1,7.5,7.5,6000,"5/8","2-1/8","-",15,20,15,20,303,480,"N/A","N/A"]
["W6E059JHA","HIGH STATIC","WAREHOUSE","ELECTRIC DEFROST - LOW TEMP",1,"THREE PHASE MOTOR","575/3/60",6,-20,59200,67900,"-",6875,"575/3/60",3,"575/3/60",1,6,6,6000,"5/8","2-1/8","-",15,20,15,20,303,480,"N/A","N/A"]
["W6E059JTA","STANDARD","WAREHOUSE","ELECTRIC DEFROST - LOW TEMP",1,"THREE PHASE MOTOR","575/3/60",6,-20,59200,67900,"-",6875,"575/3/60",2.5,"575/3/60",1,6,6,6000,"5/8","2-1/8","-",15,20,15,20,303,480,"N/A","N/A"]
["W6E072EHA","HIGH STATIC","WAREHOUSE","ELECTRIC DEFROST - LOW TEMP",2,"THREE PHASE MOTOR","208-230/3/60",6,-20,72500,83500,"-",14160,"208-230/3/60",12.8,"208-230/3/60",1,28.9,28.9,12000,"5/8","2-1/8","-",15,20,30.9,35,509,750,"N/A","N/A"]
["W6E072ETA","STANDARD","WAREHOUSE","ELECTRIC DEFROST - LOW TEMP",2,"THREE PHASE MOTOR","208-230/3/60",6,-20,72500,83500,"-",14160,"208-230/3/60",8.1999999999999993,"208-230/3/60",1,28.9,28.9,12000,"5/8","2-1/8","-",15,20,30.9,35,509,750,"N/A","N/A"]
["W6E072GHA","HIGH STATIC","WAREHOUSE","ELECTRIC DEFROST - LOW TEMP",2,"THREE PHASE MOTOR","460/3/60",6,-20,72500,83500,"-",14160,"460/3/60",6.4,"460/3/60",1,15.1,15.1,12000,"5/8","2-1/8","-",15,20,16.100000000000001,20,509,750,"N/A","N/A"]
["W6E072GTA","STANDARD","WAREHOUSE","ELECTRIC DEFROST - LOW TEMP",2,"THREE PHASE MOTOR","460/3/60",6,-20,72500,83500,"-",14160,"460/3/60",4,"460/3/60",1,15.1,15.1,12000,"5/8","2-1/8","-",15,20,16.100000000000001,20,509,750,"N/A","N/A"]
["W6E072JHA","HIGH STATIC","WAREHOUSE","ELECTRIC DEFROST - LOW TEMP",2,"THREE PHASE MOTOR","575/3/60",6,-20,72500,83500,"-",14160,"575/3/60",6,"575/3/60",1,12,12,12000,"5/8","2-1/8","-",15,20,15,20,509,750,"N/A","N/A"]
["W6E072JTA","STANDARD","WAREHOUSE","ELECTRIC DEFROST - LOW TEMP",2,"THREE PHASE MOTOR","575/3/60",6,-20,72500,83500,"-",14160,"575/3/60",5,"575/3/60",1,12,12,12000,"5/8","2-1/8","-",15,20,15,20,509,750,"N/A","N/A"]
["W6E096EHA","HIGH STATIC","WAREHOUSE","ELECTRIC DEFROST - LOW TEMP",2,"THREE PHASE MOTOR","208-230/3/60",6,-20,96100,109400,"-",14030,"208-230/3/60",12.8,"208-230/3/60",1,28.9,28.9,12000,"7/8","3-1/8","-",15,20,30.9,35,509,750,"N/A","N/A"]
["W6E096ETA","STANDARD","WAREHOUSE","ELECTRIC DEFROST - LOW TEMP",2,"THREE PHASE MOTOR","208-230/3/60",6,-20,96100,109400,"-",14030,"208-230/3/60",8.1999999999999993,"208-230/3/60",1,28.9,28.9,12000,"7/8","3-1/8","-",15,20,30.9,35,509,750,"N/A","N/A"]
["W6E096GHA","HIGH STATIC","WAREHOUSE","ELECTRIC DEFROST - LOW TEMP",2,"THREE PHASE MOTOR","460/3/60",6,-20,96100,109400,"-",14030,"460/3/60",6.4,"460/3/60",1,15.1,15.1,12000,"7/8","3-1/8","-",15,20,16.100000000000001,20,509,750,"N/A","N/A"]
["W6E096GTA","STANDARD","WAREHOUSE","ELECTRIC DEFROST - LOW TEMP",2,"THREE PHASE MOTOR","460/3/60",6,-20,96100,109400,"-",14030,"460/3/60",4,"460/3/60",1,15.1,15.1,12000,"7/8","3-1/8","-",15,20,16.100000000000001,20,509,750,"N/A","N/A"]
["W6E096JHA","HIGH STATIC","WAREHOUSE","ELECTRIC DEFROST - LOW TEMP",2,"THREE PHASE MOTOR","575/3/60",6,-20,96100,109400,"-",14030,"575/3/60",6,"575/3/60",1,12,12,12000,"7/8","3-1/8","-",15,20,15,20,509,750,"N/A","N/A"]
["W6E096JTA","STANDARD","WAREHOUSE","ELECTRIC DEFROST - LOW TEMP",2,"THREE PHASE MOTOR","575/3/60",6,-20,96100,109400,"-",14030,"575/3/60",5,"575/3/60",1,12,12,12000,"7/8","3-1/8","-",15,20,15,20,509,750,"N/A","N/A"]
["W6E120EHA","HIGH STATIC","WAREHOUSE","ELECTRIC DEFROST - LOW TEMP",2,"THREE PHASE MOTOR","208-230/3/60",6,-20,120000,137200,"-",13750,"208-230/3/60",12.8,"208-230/3/60",1,28.9,28.9,12000,"7/8","3-1/8","-",15,20,30.9,35,509,750,"N/A","N/A"]
["W6E120ETA","STANDARD","WAREHOUSE","ELECTRIC DEFROST - LOW TEMP",2,"THREE PHASE MOTOR","208-230/3/60",6,-20,120000,137200,"-",13750,"208-230/3/60",8.1999999999999993,"208-230/3/60",1,28.9,28.9,12000,"7/8","3-1/8","-",15,20,30.9,35,509,750,"N/A","N/A"]
["W6E120GHA","HIGH STATIC","WAREHOUSE","ELECTRIC DEFROST - LOW TEMP",2,"THREE PHASE MOTOR","460/3/60",6,-20,120000,137200,"-",13750,"460/3/60",6.4,"460/3/60",1,15.1,15.1,12000,"7/8","3-1/8","-",15,20,16.100000000000001,20,509,750,"N/A","N/A"]
["W6E120GTA","STANDARD","WAREHOUSE","ELECTRIC DEFROST - LOW TEMP",2,"THREE PHASE MOTOR","460/3/60",6,-20,120000,137200,"-",13750,"460/3/60",4,"460/3/60",1,15.1,15.1,12000,"7/8","3-1/8","-",15,20,16.100000000000001,20,509,750,"N/A","N/A"]
["W6E120JHA","HIGH STATIC","WAREHOUSE","ELECTRIC DEFROST - LOW TEMP",2,"THREE PHASE MOTOR","575/3/60",6,-20,120000,137200,"-",13750,"575/3/60",6,"575/3/60",1,12,12,12000,"7/8","3-1/8","-",15,20,15,20,509,750,"N/A","N/A"]
["W6E120JTA","STANDARD","WAREHOUSE","ELECTRIC DEFROST - LOW TEMP",2,"THREE PHASE MOTOR","575/3/60",6,-20,120000,137200,"-",13750,"575/3/60",5,"575/3/60",1,12,12,12000,"7/8","3-1/8","-",15,20,15,20,509,750,"N/A","N/A"]
["W6E143EHA","HIGH STATIC","WAREHOUSE","ELECTRIC DEFROST - LOW TEMP",3,"THREE PHASE MOTOR","208-230/3/60",6,-20,143600,163100,"-",21040,"208-230/3/60",19.2,"208-230/3/60",1,43.3,43.3,18000,"1-1/8","3-1/8","-",20.8,25,45.3,50,682,1030,"N/A","N/A"]
["W6E143ETA","STANDARD","WAREHOUSE","ELECTRIC DEFROST - LOW TEMP",3,"THREE PHASE MOTOR","208-230/3/60",6,-20,143600,163100,"-",21040,"208-230/3/60",12.3,"208-230/3/60",1,43.3,43.3,18000,"1-1/8","3-1/8","-",15,20,45.3,50,682,1030,"N/A","N/A"]
["W6E143GHA","HIGH STATIC","WAREHOUSE","ELECTRIC DEFROST - LOW TEMP",3,"THREE PHASE MOTOR","460/3/60",6,-20,143600,163100,"-",21040,"460/3/60",9.6,"460/3/60",1,22.6,22.6,18000,"1-1/8","3-1/8","-",15,20,23.6,25,682,1030,"N/A","N/A"]
["W6E143GTA","STANDARD","WAREHOUSE","ELECTRIC DEFROST - LOW TEMP",3,"THREE PHASE MOTOR","460/3/60",6,-20,143600,163100,"-",21040,"460/3/60",6,"460/3/60",1,22.6,22.6,18000,"1-1/8","3-1/8","-",15,20,23.6,25,682,1030,"N/A","N/A"]
["W6E143JHA","HIGH STATIC","WAREHOUSE","ELECTRIC DEFROST - LOW TEMP",3,"THREE PHASE MOTOR","575/3/60",6,-20,143600,163100,"-",21040,"575/3/60",9,"575/3/60",1,18.100000000000001,18.100000000000001,18000,"1-1/8","3-1/8","-",15,20,19.100000000000001,25,682,1030,"N/A","N/A"]
["W6E143JTA","STANDARD","WAREHOUSE","ELECTRIC DEFROST - LOW TEMP",3,"THREE PHASE MOTOR","575/3/60",6,-20,143600,163100,"-",21040,"575/3/60",7.5,"575/3/60",1,18.100000000000001,18.100000000000001,18000,"1-1/8","3-1/8","-",15,20,19.100000000000001,25,682,1030,"N/A","N/A"]
["W6E179EHA","HIGH STATIC","WAREHOUSE","ELECTRIC DEFROST - LOW TEMP",3,"THREE PHASE MOTOR","208-230/3/60",6,-20,179500,206600,"-",20625,"208-230/3/60",19.2,"208-230/3/60",1,43.3,43.3,18000,"1-1/8","3-1/8","-",20.8,25,45.3,50,682,1030,"N/A","N/A"]
["W6E179ETA","STANDARD","WAREHOUSE","ELECTRIC DEFROST - LOW TEMP",3,"THREE PHASE MOTOR","208-230/3/60",6,-20,179500,206600,"-",20625,"208-230/3/60",12.3,"208-230/3/60",1,43.3,43.3,18000,"1-1/8","3-1/8","-",15,20,45.3,50,682,1030,"N/A","N/A"]
["W6E179GHA","HIGH STATIC","WAREHOUSE","ELECTRIC DEFROST - LOW TEMP",3,"THREE PHASE MOTOR","460/3/60",6,-20,179500,206600,"-",20625,"460/3/60",9.6,"460/3/60",1,22.6,22.6,18000,"1-1/8","3-1/8","-",15,20,23.6,25,682,1030,"N/A","N/A"]
["W6E179GTA","STANDARD","WAREHOUSE","ELECTRIC DEFROST - LOW TEMP",3,"THREE PHASE MOTOR","460/3/60",6,-20,179500,206600,"-",20625,"460/3/60",6,"460/3/60",1,22.6,22.6,18000,"1-1/8","3-1/8","-",15,20,23.6,25,682,1030,"N/A","N/A"]
["W6E179JHA","HIGH STATIC","WAREHOUSE","ELECTRIC DEFROST - LOW TEMP",3,"THREE PHASE MOTOR","575/3/60",6,-20,179500,206600,"-",20625,"575/3/60",9,"575/3/60",1,18.100000000000001,18.100000000000001,18000,"1-1/8","3-1/8","-",15,20,19.100000000000001,25,682,1030,"N/A","N/A"]
["W6E179JTA","STANDARD","WAREHOUSE","ELECTRIC DEFROST - LOW TEMP",3,"THREE PHASE MOTOR","575/3/60",6,-20,179500,206600,"-",20625,"575/3/60",7.5,"575/3/60",1,18.100000000000001,18.100000000000001,18000,"1-1/8","3-1/8","-",15,20,19.100000000000001,25,682,1030,"N/A","N/A"]
["W6E216EHA","HIGH STATIC","WAREHOUSE","ELECTRIC DEFROST - LOW TEMP",4,"THREE PHASE MOTOR","208-230/3/60",6,-20,216200,246100,"-",27500,"208-230/3/60",25.6,"208-230/3/60",2,28.9,57.7,24000,"1-1/8","3-1/8","-",27.2,30,59.7,60,1050,1360,"N/A","N/A"]
["W6E216ETA","STANDARD","WAREHOUSE","ELECTRIC DEFROST - LOW TEMP",4,"THREE PHASE MOTOR","208-230/3/60",6,-20,216200,246100,"-",27500,"208-230/3/60",16.399999999999999,"208-230/3/60",2,28.9,57.7,24000,"1-1/8","3-1/8","-",17.399999999999999,20,59.7,60,1050,1360,"N/A","N/A"]
["W6E216GHA","HIGH STATIC","WAREHOUSE","ELECTRIC DEFROST - LOW TEMP",4,"THREE PHASE MOTOR","460/3/60",6,-20,216200,246100,"-",27500,"460/3/60",12.8,"460/3/60",1,30.1,30.1,24000,"1-1/8","3-1/8","-",15,20,31.1,35,1050,1360,"N/A","N/A"]
["W6E216GTA","STANDARD","WAREHOUSE","ELECTRIC DEFROST - LOW TEMP",4,"THREE PHASE MOTOR","460/3/60",6,-20,216200,246100,"-",27500,"460/3/60",8,"460/3/60",1,30.1,30.1,24000,"1-1/8","3-1/8","-",15,20,31.1,35,1050,1360,"N/A","N/A"]
["W6E216JHA","HIGH STATIC","WAREHOUSE","ELECTRIC DEFROST - LOW TEMP",4,"THREE PHASE MOTOR","575/3/60",6,-20,216200,246100,"-",27500,"575/3/60",12,"575/3/60",1,24.1,24.1,24000,"1-1/8","3-1/8","-",15,20,25.1,30,1050,1360,"N/A","N/A"]
["W6E216JTA","STANDARD","WAREHOUSE","ELECTRIC DEFROST - LOW TEMP",4,"THREE PHASE MOTOR","575/3/60",6,-20,216200,246100,"-",27500,"575/3/60",10,"575/3/60",1,24.1,24.1,24000,"1-1/8","3-1/8","-",15,20,25.1,30,1050,1360,"N/A","N/A"]
["W6G036EHA","HIGH STATIC","WAREHOUSE","HOT GAS - REVERSE CYCLE - ELECTRIC PAN",1,"THREE PHASE MOTOR","208-230/3/60",6,-20,36400,41900,"-",7080,"208-230/3/60",6.4,"208-230/1/60",1,8.3000000000000007,8.3000000000000007,2000,"1/2","2-1/8","-",15,20,"-","-",303,480,"N/A","N/A"]
["W6G036ETA","STANDARD","WAREHOUSE","HOT GAS - REVERSE CYCLE - ELECTRIC PAN",1,"THREE PHASE MOTOR","208-230/3/60",6,-20,36400,41900,"-",7080,"208-230/3/60",4.0999999999999996,"208-230/1/60",1,8.3000000000000007,8.3000000000000007,2000,"1/2","2-1/8","-",15,20,"-","-",303,480,"N/A","N/A"]
["W6G036GHA","HIGH STATIC","WAREHOUSE","HOT GAS - REVERSE CYCLE - ELECTRIC PAN",1,"THREE PHASE MOTOR","460/3/60",6,-20,36400,41900,"-",7080,"460/3/60",3.2,"460/1/60",1,4.3,4.3,2000,"1/2","2-1/8","-",15,20,"-","-",303,480,"N/A","N/A"]
["W6G036GTA","STANDARD","WAREHOUSE","HOT GAS - REVERSE CYCLE - ELECTRIC PAN",1,"THREE PHASE MOTOR","460/3/60",6,-20,36400,41900,"-",7080,"460/3/60",2,"460/1/60",1,4.3,4.3,2000,"1/2","2-1/8","-",15,20,"-","-",303,480,"N/A","N/A"]
["W6G036JHA","HIGH STATIC","WAREHOUSE","HOT GAS - REVERSE CYCLE - ELECTRIC PAN",1,"THREE PHASE MOTOR","575/3/60",6,-20,36400,41900,"-",7080,"575/3/60",3,"575/1/60",1,2,2,2000,"1/2","2-1/8","-",15,20,"-","-",303,480,"N/A","N/A"]
["W6G036JTA","STANDARD","WAREHOUSE","HOT GAS - REVERSE CYCLE - ELECTRIC PAN",1,"THREE PHASE MOTOR","575/3/60",6,-20,36400,41900,"-",7080,"575/3/60",2.5,"575/1/60",1,2,2,2000,"1/2","2-1/8","-",15,20,"-","-",303,480,"N/A","N/A"]
["W6G047EHA","HIGH STATIC","WAREHOUSE","HOT GAS - REVERSE CYCLE - ELECTRIC PAN",1,"THREE PHASE MOTOR","208-230/3/60",6,-20,47900,54600,"-",7010,"208-230/3/60",6.4,"208-230/1/60",1,8.3000000000000007,8.3000000000000007,2000,"5/8","2-1/8","-",15,20,"-","-",303,480,"N/A","N/A"]
["W6G047ETA","STANDARD","WAREHOUSE","HOT GAS - REVERSE CYCLE - ELECTRIC PAN",1,"THREE PHASE MOTOR","208-230/3/60",6,-20,47900,54600,"-",7010,"208-230/3/60",4.0999999999999996,"208-230/1/60",1,8.3000000000000007,8.3000000000000007,2000,"5/8","2-1/8","-",15,20,"-","-",303,480,"N/A","N/A"]
["W6G047GHA","HIGH STATIC","WAREHOUSE","HOT GAS - REVERSE CYCLE - ELECTRIC PAN",1,"THREE PHASE MOTOR","460/3/60",6,-20,47900,54600,"-",7010,"460/3/60",3.2,"460/1/60",1,4.3,4.3,2000,"5/8","2-1/8","-",15,20,"-","-",303,480,"N/A","N/A"]
["W6G047GTA","STANDARD","WAREHOUSE","HOT GAS - REVERSE CYCLE - ELECTRIC PAN",1,"THREE PHASE MOTOR","460/3/60",6,-20,47900,54600,"-",7010,"460/3/60",2,"460/1/60",1,4.3,4.3,2000,"5/8","2-1/8","-",15,20,"-","-",303,480,"N/A","N/A"]
["W6G047JHA","HIGH STATIC","WAREHOUSE","HOT GAS - REVERSE CYCLE - ELECTRIC PAN",1,"THREE PHASE MOTOR","575/3/60",6,-20,47900,54600,"-",7010,"575/3/60",3,"575/1/60",1,2,2,2000,"5/8","2-1/8","-",15,20,"-","-",303,480,"N/A","N/A"]
["W6G047JTA","STANDARD","WAREHOUSE","HOT GAS - REVERSE CYCLE - ELECTRIC PAN",1,"THREE PHASE MOTOR","575/3/60",6,-20,47900,54600,"-",7010,"575/3/60",2.5,"575/1/60",1,2,2,2000,"5/8","2-1/8","-",15,20,"-","-",303,480,"N/A","N/A"]
["W6G059EHA","HIGH STATIC","WAREHOUSE","HOT GAS - REVERSE CYCLE - ELECTRIC PAN",1,"THREE PHASE MOTOR","208-230/3/60",6,-20,59200,67900,"-",6875,"208-230/3/60",6.4,"208-230/1/60",1,8.3000000000000007,8.3000000000000007,2000,"5/8","2-1/8","-",15,20,"-","-",303,480,"N/A","N/A"]
["W6G059ETA","STANDARD","WAREHOUSE","HOT GAS - REVERSE CYCLE - ELECTRIC PAN",1,"THREE PHASE MOTOR","208-230/3/60",6,-20,59200,67900,"-",6875,"208-230/3/60",4.0999999999999996,"208-230/1/60",1,8.3000000000000007,8.3000000000000007,2000,"5/8","2-1/8","-",15,20,"-","-",303,480,"N/A","N/A"]
["W6G059GHA","HIGH STATIC","WAREHOUSE","HOT GAS - REVERSE CYCLE - ELECTRIC PAN",1,"THREE PHASE MOTOR","460/3/60",6,-20,59200,67900,"-",6875,"460/3/60",3.2,"460/1/60",1,4.3,4.3,2000,"5/8","2-1/8","-",15,20,"-","-",303,480,"N/A","N/A"]
["W6G059GTA","STANDARD","WAREHOUSE","HOT GAS - REVERSE CYCLE - ELECTRIC PAN",1,"THREE PHASE MOTOR","460/3/60",6,-20,59200,67900,"-",6875,"460/3/60",2,"460/1/60",1,4.3,4.3,2000,"5/8","2-1/8","-",15,20,"-","-",303,480,"N/A","N/A"]
["W6G059JHA","HIGH STATIC","WAREHOUSE","HOT GAS - REVERSE CYCLE - ELECTRIC PAN",1,"THREE PHASE MOTOR","575/3/60",6,-20,59200,67900,"-",6875,"575/3/60",3,"575/1/60",1,2,2,2000,"5/8","2-1/8","-",15,20,"-","-",303,480,"N/A","N/A"]
["W6G059JTA","STANDARD","WAREHOUSE","HOT GAS - REVERSE CYCLE - ELECTRIC PAN",1,"THREE PHASE MOTOR","575/3/60",6,-20,59200,67900,"-",6875,"575/3/60",2.5,"575/1/60",1,2,2,2000,"5/8","2-1/8","-",15,20,"-","-",303,480,"N/A","N/A"]
["W6G072EHA","HIGH STATIC","WAREHOUSE","HOT GAS - REVERSE CYCLE - ELECTRIC PAN",2,"THREE PHASE MOTOR","208-230/3/60",6,-20,72500,83500,"-",14160,"208-230/3/60",12.8,"208-230/1/60",1,16.7,16.7,4000,"5/8","2-1/8","-",15,20,"-","-",509,750,"N/A","N/A"]
["W6G072ETA","STANDARD","WAREHOUSE","HOT GAS - REVERSE CYCLE - ELECTRIC PAN",2,"THREE PHASE MOTOR","208-230/3/60",6,-20,72500,83500,"-",14160,"208-230/3/60",8.1999999999999993,"208-230/1/60",1,16.7,16.7,4000,"5/8","2-1/8","-",15,20,"-","-",509,750,"N/A","N/A"]
["W6G072GHA","HIGH STATIC","WAREHOUSE","HOT GAS - REVERSE CYCLE - ELECTRIC PAN",2,"THREE PHASE MOTOR","460/3/60",6,-20,72500,83500,"-",14160,"460/3/60",6.4,"460/1/60",1,8.6999999999999993,8.6999999999999993,4000,"5/8","2-1/8","-",15,20,"-","-",509,750,"N/A","N/A"]
["W6G072GTA","STANDARD","WAREHOUSE","HOT GAS - REVERSE CYCLE - ELECTRIC PAN",2,"THREE PHASE MOTOR","460/3/60",6,-20,72500,83500,"-",14160,"460/3/60",4,"460/1/60",1,8.6999999999999993,8.6999999999999993,4000,"5/8","2-1/8","-",15,20,"-","-",509,750,"N/A","N/A"]
["W6G072JHA","HIGH STATIC","WAREHOUSE","HOT GAS - REVERSE CYCLE - ELECTRIC PAN",2,"THREE PHASE MOTOR","575/3/60",6,-20,72500,83500,"-",14160,"575/3/60",6,"575/1/60",1,4,4,4000,"5/8","2-1/8","-",15,20,"-","-",509,750,"N/A","N/A"]
["W6G072JTA","STANDARD","WAREHOUSE","HOT GAS - REVERSE CYCLE - ELECTRIC PAN",2,"THREE PHASE MOTOR","575/3/60",6,-20,72500,83500,"-",14160,"575/3/60",5,"575/1/60",1,4,4,4000,"5/8","2-1/8","-",15,20,"-","-",509,750,"N/A","N/A"]
["W6G096EHA","HIGH STATIC","WAREHOUSE","HOT GAS - REVERSE CYCLE - ELECTRIC PAN",2,"THREE PHASE MOTOR","208-230/3/60",6,-20,96100,109400,"-",14030,"208-230/3/60",12.8,"208-230/1/60",1,16.7,16.7,4000,"7/8","3-1/8","-",15,20,"-","-",509,750,"N/A","N/A"]
["W6G096ETA","STANDARD","WAREHOUSE","HOT GAS - REVERSE CYCLE - ELECTRIC PAN",2,"THREE PHASE MOTOR","208-230/3/60",6,-20,96100,109400,"-",14030,"208-230/3/60",8.1999999999999993,"208-230/1/60",1,16.7,16.7,4000,"7/8","3-1/8","-",15,20,"-","-",509,750,"N/A","N/A"]
["W6G096GHA","HIGH STATIC","WAREHOUSE","HOT GAS - REVERSE CYCLE - ELECTRIC PAN",2,"THREE PHASE MOTOR","460/3/60",6,-20,96100,109400,"-",14030,"460/3/60",6.4,"460/1/60",1,8.6999999999999993,8.6999999999999993,4000,"7/8","3-1/8","-",15,20,"-","-",509,750,"N/A","N/A"]
["W6G096GTA","STANDARD","WAREHOUSE","HOT GAS - REVERSE CYCLE - ELECTRIC PAN",2,"THREE PHASE MOTOR","460/3/60",6,-20,96100,109400,"-",14030,"460/3/60",4,"460/1/60",1,8.6999999999999993,8.6999999999999993,4000,"7/8","3-1/8","-",15,20,"-","-",509,750,"N/A","N/A"]
["W6G096JHA","HIGH STATIC","WAREHOUSE","HOT GAS - REVERSE CYCLE - ELECTRIC PAN",2,"THREE PHASE MOTOR","575/3/60",6,-20,96100,109400,"-",14030,"575/3/60",6,"575/1/60",1,4,4,4000,"7/8","3-1/8","-",15,20,"-","-",509,750,"N/A","N/A"]
["W6G096JTA","STANDARD","WAREHOUSE","HOT GAS - REVERSE CYCLE - ELECTRIC PAN",2,"THREE PHASE MOTOR","575/3/60",6,-20,96100,109400,"-",14030,"575/3/60",5,"575/1/60",1,4,4,4000,"7/8","3-1/8","-",15,20,"-","-",509,750,"N/A","N/A"]
["W6G120EHA","HIGH STATIC","WAREHOUSE","HOT GAS - REVERSE CYCLE - ELECTRIC PAN",2,"THREE PHASE MOTOR","208-230/3/60",6,-20,120000,137200,"-",13750,"208-230/3/60",12.8,"208-230/1/60",1,16.7,16.7,4000,"7/8","3-1/8","-",15,20,"-","-",509,750,"N/A","N/A"]
["W6G120ETA","STANDARD","WAREHOUSE","HOT GAS - REVERSE CYCLE - ELECTRIC PAN",2,"THREE PHASE MOTOR","208-230/3/60",6,-20,120000,137200,"-",13750,"208-230/3/60",8.1999999999999993,"208-230/1/60",1,16.7,16.7,4000,"7/8","3-1/8","-",15,20,"-","-",509,750,"N/A","N/A"]
["W6G120GHA","HIGH STATIC","WAREHOUSE","HOT GAS - REVERSE CYCLE - ELECTRIC PAN",2,"THREE PHASE MOTOR","460/3/60",6,-20,120000,137200,"-",13750,"460/3/60",6.4,"460/1/60",1,8.6999999999999993,8.6999999999999993,4000,"7/8","3-1/8","-",15,20,"-","-",509,750,"N/A","N/A"]
["W6G120GTA","STANDARD","WAREHOUSE","HOT GAS - REVERSE CYCLE - ELECTRIC PAN",2,"THREE PHASE MOTOR","460/3/60",6,-20,120000,137200,"-",13750,"460/3/60",4,"460/1/60",1,8.6999999999999993,8.6999999999999993,4000,"7/8","3-1/8","-",15,20,"-","-",509,750,"N/A","N/A"]
["W6G120JHA","HIGH STATIC","WAREHOUSE","HOT GAS - REVERSE CYCLE - ELECTRIC PAN",2,"THREE PHASE MOTOR","575/3/60",6,-20,120000,137200,"-",13750,"575/3/60",6,"575/1/60",1,4,4,4000,"7/8","3-1/8","-",15,20,"-","-",509,750,"N/A","N/A"]
["W6G120JTA","STANDARD","WAREHOUSE","HOT GAS - REVERSE CYCLE - ELECTRIC PAN",2,"THREE PHASE MOTOR","575/3/60",6,-20,120000,137200,"-",13750,"575/3/60",5,"575/1/60",1,4,4,4000,"7/8","3-1/8","-",15,20,"-","-",509,750,"N/A","N/A"]
["W6G143EHA","HIGH STATIC","WAREHOUSE","HOT GAS - REVERSE CYCLE - ELECTRIC PAN",3,"THREE PHASE MOTOR","208-230/3/60",6,-20,143600,163100,"-",21040,"208-230/3/60",19.2,"208-230/1/60",1,25,25,6000,"1-1/8","3-1/8","-",20.8,25,"-","-",682,1030,"N/A","N/A"]
["W6G143ETA","STANDARD","WAREHOUSE","HOT GAS - REVERSE CYCLE - ELECTRIC PAN",3,"THREE PHASE MOTOR","208-230/3/60",6,-20,143600,163100,"-",21040,"208-230/3/60",12.3,"208-230/1/60",1,25,25,6000,"1-1/8","3-1/8","-",15,20,"-","-",682,1030,"N/A","N/A"]
["W6G143GHA","HIGH STATIC","WAREHOUSE","HOT GAS - REVERSE CYCLE - ELECTRIC PAN",3,"THREE PHASE MOTOR","460/3/60",6,-20,143600,163100,"-",21040,"460/3/60",9.6,"460/1/60",1,13,13,6000,"1-1/8","3-1/8","-",15,20,"-","-",682,1030,"N/A","N/A"]
["W6G143GTA","STANDARD","WAREHOUSE","HOT GAS - REVERSE CYCLE - ELECTRIC PAN",3,"THREE PHASE MOTOR","460/3/60",6,-20,143600,163100,"-",21040,"460/3/60",6,"460/1/60",1,13,13,6000,"1-1/8","3-1/8","-",15,20,"-","-",682,1030,"N/A","N/A"]
["W6G143JHA","HIGH STATIC","WAREHOUSE","HOT GAS - REVERSE CYCLE - ELECTRIC PAN",3,"THREE PHASE MOTOR","575/3/60",6,-20,143600,163100,"-",21040,"575/3/60",9,"575/1/60",1,6,6,6000,"1-1/8","3-1/8","-",15,20,"-","-",682,1030,"N/A","N/A"]
["W6G143JTA","STANDARD","WAREHOUSE","HOT GAS - REVERSE CYCLE - ELECTRIC PAN",3,"THREE PHASE MOTOR","575/3/60",6,-20,143600,163100,"-",21040,"575/3/60",7.5,"575/1/60",1,6,6,6000,"1-1/8","3-1/8","-",15,20,"-","-",682,1030,"N/A","N/A"]
["W6G179EHA","HIGH STATIC","WAREHOUSE","HOT GAS - REVERSE CYCLE - ELECTRIC PAN",3,"THREE PHASE MOTOR","208-230/3/60",6,-20,179500,206600,"-",20625,"208-230/3/60",19.2,"208-230/1/60",1,25,25,6000,"1-1/8","3-1/8","-",20.8,25,"-","-",682,1030,"N/A","N/A"]
["W6G179ETA","STANDARD","WAREHOUSE","HOT GAS - REVERSE CYCLE - ELECTRIC PAN",3,"THREE PHASE MOTOR","208-230/3/60",6,-20,179500,206600,"-",20625,"208-230/3/60",12.3,"208-230/1/60",1,25,25,6000,"1-1/8","3-1/8","-",15,20,"-","-",682,1030,"N/A","N/A"]
["W6G179GHA","HIGH STATIC","WAREHOUSE","HOT GAS - REVERSE CYCLE - ELECTRIC PAN",3,"THREE PHASE MOTOR","460/3/60",6,-20,179500,206600,"-",20625,"460/3/60",9.6,"460/1/60",1,13,13,6000,"1-1/8","3-1/8","-",15,20,"-","-",682,1030,"N/A","N/A"]
["W6G179GTA","STANDARD","WAREHOUSE","HOT GAS - REVERSE CYCLE - ELECTRIC PAN",3,"THREE PHASE MOTOR","460/3/60",6,-20,179500,206600,"-",20625,"460/3/60",6,"460/1/60",1,13,13,6000,"1-1/8","3-1/8","-",15,20,"-","-",682,1030,"N/A","N/A"]
["W6G179JHA","HIGH STATIC","WAREHOUSE","HOT GAS - REVERSE CYCLE - ELECTRIC PAN",3,"THREE PHASE MOTOR","575/3/60",6,-20,179500,206600,"-",20625,"575/3/60",9,"575/1/60",1,6,6,6000,"1-1/8","3-1/8","-",15,20,"-","-",682,1030,"N/A","N/A"]
["W6G179JTA","STANDARD","WAREHOUSE","HOT GAS - REVERSE CYCLE - ELECTRIC PAN",3,"THREE PHASE MOTOR","575/3/60",6,-20,179500,206600,"-",20625,"575/3/60",7.5,"575/1/60",1,6,6,6000,"1-1/8","3-1/8","-",15,20,"-","-",682,1030,"N/A","N/A"]
["W6G216EHA","HIGH STATIC","WAREHOUSE","HOT GAS - REVERSE CYCLE - ELECTRIC PAN",4,"THREE PHASE MOTOR","208-230/3/60",6,-20,216200,246100,"-",27500,"208-230/3/60",25.6,"208-230/1/60",1,33.299999999999997,33.299999999999997,8000,"1-1/8","3-1/8","-",27.2,30,"-","-",1050,1360,"N/A","N/A"]
["W6G216ETA","STANDARD","WAREHOUSE","HOT GAS - REVERSE CYCLE - ELECTRIC PAN",4,"THREE PHASE MOTOR","208-230/3/60",6,-20,216200,246100,"-",27500,"208-230/3/60",16.399999999999999,"208-230/1/60",1,33.299999999999997,33.299999999999997,8000,"1-1/8","3-1/8","-",17.399999999999999,20,"-","-",1050,1360,"N/A","N/A"]
["W6G216GHA","HIGH STATIC","WAREHOUSE","HOT GAS - REVERSE CYCLE - ELECTRIC PAN",4,"THREE PHASE MOTOR","460/3/60",6,-20,216200,246100,"-",27500,"460/3/60",12.8,"460/1/60",1,17.399999999999999,17.399999999999999,8000,"1-1/8","3-1/8","-",15,20,"-","-",1050,1360,"N/A","N/A"]
["W6G216GTA","STANDARD","WAREHOUSE","HOT GAS - REVERSE CYCLE - ELECTRIC PAN",4,"THREE PHASE MOTOR","460/3/60",6,-20,216200,246100,"-",27500,"460/3/60",8,"460/1/60",1,17.399999999999999,17.399999999999999,8000,"1-1/8","3-1/8","-",15,20,"-","-",1050,1360,"N/A","N/A"]
["W6G216JHA","HIGH STATIC","WAREHOUSE","HOT GAS - REVERSE CYCLE - ELECTRIC PAN",4,"THREE PHASE MOTOR","575/3/60",6,-20,216200,246100,"-",27500,"575/3/60",12,"575/1/60",1,8,8,8000,"1-1/8","3-1/8","-",15,20,"-","-",1050,1360,"N/A","N/A"]
["W6G216JTA","STANDARD","WAREHOUSE","HOT GAS - REVERSE CYCLE - ELECTRIC PAN",4,"THREE PHASE MOTOR","575/3/60",6,-20,216200,246100,"-",27500,"575/3/60",10,"575/1/60",1,8,8,8000,"1-1/8","3-1/8","-",15,20,"-","-",1050,1360,"N/A","N/A"]
["W6H036EHA","HIGH STATIC","WAREHOUSE","HOT GAS - 3-PIPE - ELECTRIC PAN",1,"THREE PHASE MOTOR","208-230/3/60",6,-20,36400,41900,"-",7080,"208-230/3/60",6.4,"208-230/1/60",1,8.3000000000000007,8.3000000000000007,2000,"1/2","2-1/8","-",15,20,"-","-",303,480,"N/A","N/A"]
["W6H036ETA","STANDARD","WAREHOUSE","HOT GAS - 3-PIPE - ELECTRIC PAN",1,"THREE PHASE MOTOR","208-230/3/60",6,-20,36400,41900,"-",7080,"208-230/3/60",4.0999999999999996,"208-230/1/60",1,8.3000000000000007,8.3000000000000007,2000,"1/2","2-1/8","-",15,20,"-","-",303,480,"N/A","N/A"]
["W6H036GHA","HIGH STATIC","WAREHOUSE","HOT GAS - 3-PIPE - ELECTRIC PAN",1,"THREE PHASE MOTOR","460/3/60",6,-20,36400,41900,"-",7080,"460/3/60",3.2,"460/1/60",1,4.3,4.3,2000,"1/2","2-1/8","-",15,20,"-","-",303,480,"N/A","N/A"]
["W6H036GTA","STANDARD","WAREHOUSE","HOT GAS - 3-PIPE - ELECTRIC PAN",1,"THREE PHASE MOTOR","460/3/60",6,-20,36400,41900,"-",7080,"460/3/60",2,"460/1/60",1,4.3,4.3,2000,"1/2","2-1/8","-",15,20,"-","-",303,480,"N/A","N/A"]
["W6H036JHA","HIGH STATIC","WAREHOUSE","HOT GAS - 3-PIPE - ELECTRIC PAN",1,"THREE PHASE MOTOR","575/3/60",6,-20,36400,41900,"-",7080,"575/3/60",3,"575/1/60",1,2,2,2000,"1/2","2-1/8","-",15,20,"-","-",303,480,"N/A","N/A"]
["W6H036JTA","STANDARD","WAREHOUSE","HOT GAS - 3-PIPE - ELECTRIC PAN",1,"THREE PHASE MOTOR","575/3/60",6,-20,36400,41900,"-",7080,"575/3/60",2.5,"575/1/60",1,2,2,2000,"1/2","2-1/8","-",15,20,"-","-",303,480,"N/A","N/A"]
["W6H047EHA","HIGH STATIC","WAREHOUSE","HOT GAS - 3-PIPE - ELECTRIC PAN",1,"THREE PHASE MOTOR","208-230/3/60",6,-20,47900,54600,"-",7010,"208-230/3/60",6.4,"208-230/1/60",1,8.3000000000000007,8.3000000000000007,2000,"5/8","2-1/8","-",15,20,"-","-",303,480,"N/A","N/A"]
["W6H047ETA","STANDARD","WAREHOUSE","HOT GAS - 3-PIPE - ELECTRIC PAN",1,"THREE PHASE MOTOR","208-230/3/60",6,-20,47900,54600,"-",7010,"208-230/3/60",4.0999999999999996,"208-230/1/60",1,8.3000000000000007,8.3000000000000007,2000,"5/8","2-1/8","-",15,20,"-","-",303,480,"N/A","N/A"]
["W6H047GHA","HIGH STATIC","WAREHOUSE","HOT GAS - 3-PIPE - ELECTRIC PAN",1,"THREE PHASE MOTOR","460/3/60",6,-20,47900,54600,"-",7010,"460/3/60",3.2,"460/1/60",1,4.3,4.3,2000,"5/8","2-1/8","-",15,20,"-","-",303,480,"N/A","N/A"]
["W6H047GTA","STANDARD","WAREHOUSE","HOT GAS - 3-PIPE - ELECTRIC PAN",1,"THREE PHASE MOTOR","460/3/60",6,-20,47900,54600,"-",7010,"460/3/60",2,"460/1/60",1,4.3,4.3,2000,"5/8","2-1/8","-",15,20,"-","-",303,480,"N/A","N/A"]
["W6H047JHA","HIGH STATIC","WAREHOUSE","HOT GAS - 3-PIPE - ELECTRIC PAN",1,"THREE PHASE MOTOR","575/3/60",6,-20,47900,54600,"-",7010,"575/3/60",3,"575/1/60",1,2,2,2000,"5/8","2-1/8","-",15,20,"-","-",303,480,"N/A","N/A"]
["W6H047JTA","STANDARD","WAREHOUSE","HOT GAS - 3-PIPE - ELECTRIC PAN",1,"THREE PHASE MOTOR","575/3/60",6,-20,47900,54600,"-",7010,"575/3/60",2.5,"575/1/60",1,2,2,2000,"5/8","2-1/8","-",15,20,"-","-",303,480,"N/A","N/A"]
["W6H059EHA","HIGH STATIC","WAREHOUSE","HOT GAS - 3-PIPE - ELECTRIC PAN",1,"THREE PHASE MOTOR","208-230/3/60",6,-20,59200,67900,"-",6875,"208-230/3/60",6.4,"208-230/1/60",1,8.3000000000000007,8.3000000000000007,2000,"5/8","2-1/8","-",15,20,"-","-",303,480,"N/A","N/A"]
["W6H059ETA","STANDARD","WAREHOUSE","HOT GAS - 3-PIPE - ELECTRIC PAN",1,"THREE PHASE MOTOR","208-230/3/60",6,-20,59200,67900,"-",6875,"208-230/3/60",4.0999999999999996,"208-230/1/60",1,8.3000000000000007,8.3000000000000007,2000,"5/8","2-1/8","-",15,20,"-","-",303,480,"N/A","N/A"]
["W6H059GHA","HIGH STATIC","WAREHOUSE","HOT GAS - 3-PIPE - ELECTRIC PAN",1,"THREE PHASE MOTOR","460/3/60",6,-20,59200,67900,"-",6875,"460/3/60",3.2,"460/1/60",1,4.3,4.3,2000,"5/8","2-1/8","-",15,20,"-","-",303,480,"N/A","N/A"]
["W6H059GTA","STANDARD","WAREHOUSE","HOT GAS - 3-PIPE - ELECTRIC PAN",1,"THREE PHASE MOTOR","460/3/60",6,-20,59200,67900,"-",6875,"460/3/60",2,"460/1/60",1,4.3,4.3,2000,"5/8","2-1/8","-",15,20,"-","-",303,480,"N/A","N/A"]
["W6H059JHA","HIGH STATIC","WAREHOUSE","HOT GAS - 3-PIPE - ELECTRIC PAN",1,"THREE PHASE MOTOR","575/3/60",6,-20,59200,67900,"-",6875,"575/3/60",3,"575/1/60",1,2,2,2000,"5/8","2-1/8","-",15,20,"-","-",303,480,"N/A","N/A"]
["W6H059JTA","STANDARD","WAREHOUSE","HOT GAS - 3-PIPE - ELECTRIC PAN",1,"THREE PHASE MOTOR","575/3/60",6,-20,59200,67900,"-",6875,"575/3/60",2.5,"575/1/60",1,2,2,2000,"5/8","2-1/8","-",15,20,"-","-",303,480,"N/A","N/A"]
["W6H072EHA","HIGH STATIC","WAREHOUSE","HOT GAS - 3-PIPE - ELECTRIC PAN",2,"THREE PHASE MOTOR","208-230/3/60",6,-20,72500,83500,"-",14160,"208-230/3/60",12.8,"208-230/1/60",1,16.7,16.7,4000,"5/8","2-1/8","-",15,20,"-","-",509,750,"N/A","N/A"]
["W6H072ETA","STANDARD","WAREHOUSE","HOT GAS - 3-PIPE - ELECTRIC PAN",2,"THREE PHASE MOTOR","208-230/3/60",6,-20,72500,83500,"-",14160,"208-230/3/60",8.1999999999999993,"208-230/1/60",1,16.7,16.7,4000,"5/8","2-1/8","-",15,20,"-","-",509,750,"N/A","N/A"]
["W6H072GHA","HIGH STATIC","WAREHOUSE","HOT GAS - 3-PIPE - ELECTRIC PAN",2,"THREE PHASE MOTOR","460/3/60",6,-20,72500,83500,"-",14160,"460/3/60",6.4,"460/1/60",1,8.6999999999999993,8.6999999999999993,4000,"5/8","2-1/8","-",15,20,"-","-",509,750,"N/A","N/A"]
["W6H072GTA","STANDARD","WAREHOUSE","HOT GAS - 3-PIPE - ELECTRIC PAN",2,"THREE PHASE MOTOR","460/3/60",6,-20,72500,83500,"-",14160,"460/3/60",4,"460/1/60",1,8.6999999999999993,8.6999999999999993,4000,"5/8","2-1/8","-",15,20,"-","-",509,750,"N/A","N/A"]
["W6H072JHA","HIGH STATIC","WAREHOUSE","HOT GAS - 3-PIPE - ELECTRIC PAN",2,"THREE PHASE MOTOR","575/3/60",6,-20,72500,83500,"-",14160,"575/3/60",6,"575/1/60",1,4,4,4000,"5/8","2-1/8","-",15,20,"-","-",509,750,"N/A","N/A"]
["W6H072JTA","STANDARD","WAREHOUSE","HOT GAS - 3-PIPE - ELECTRIC PAN",2,"THREE PHASE MOTOR","575/3/60",6,-20,72500,83500,"-",14160,"575/3/60",5,"575/1/60",1,4,4,4000,"5/8","2-1/8","-",15,20,"-","-",509,750,"N/A","N/A"]
["W6H096EHA","HIGH STATIC","WAREHOUSE","HOT GAS - 3-PIPE - ELECTRIC PAN",2,"THREE PHASE MOTOR","208-230/3/60",6,-20,96100,109400,"-",14030,"208-230/3/60",12.8,"208-230/1/60",1,16.7,16.7,4000,"7/8","3-1/8","-",15,20,"-","-",509,750,"N/A","N/A"]
["W6H096ETA","STANDARD","WAREHOUSE","HOT GAS - 3-PIPE - ELECTRIC PAN",2,"THREE PHASE MOTOR","208-230/3/60",6,-20,96100,109400,"-",14030,"208-230/3/60",8.1999999999999993,"208-230/1/60",1,16.7,16.7,4000,"7/8","3-1/8","-",15,20,"-","-",509,750,"N/A","N/A"]
["W6H096GHA","HIGH STATIC","WAREHOUSE","HOT GAS - 3-PIPE - ELECTRIC PAN",2,"THREE PHASE MOTOR","460/3/60",6,-20,96100,109400,"-",14030,"460/3/60",6.4,"460/1/60",1,8.6999999999999993,8.6999999999999993,4000,"7/8","3-1/8","-",15,20,"-","-",509,750,"N/A","N/A"]
["W6H096GTA","STANDARD","WAREHOUSE","HOT GAS - 3-PIPE - ELECTRIC PAN",2,"THREE PHASE MOTOR","460/3/60",6,-20,96100,109400,"-",14030,"460/3/60",4,"460/1/60",1,8.6999999999999993,8.6999999999999993,4000,"7/8","3-1/8","-",15,20,"-","-",509,750,"N/A","N/A"]
["W6H096JHA","HIGH STATIC","WAREHOUSE","HOT GAS - 3-PIPE - ELECTRIC PAN",2,"THREE PHASE MOTOR","575/3/60",6,-20,96100,109400,"-",14030,"575/3/60",6,"575/1/60",1,4,4,4000,"7/8","3-1/8","-",15,20,"-","-",509,750,"N/A","N/A"]
["W6H096JTA","STANDARD","WAREHOUSE","HOT GAS - 3-PIPE - ELECTRIC PAN",2,"THREE PHASE MOTOR","575/3/60",6,-20,96100,109400,"-",14030,"575/3/60",5,"575/1/60",1,4,4,4000,"7/8","3-1/8","-",15,20,"-","-",509,750,"N/A","N/A"]
["W6H120EHA","HIGH STATIC","WAREHOUSE","HOT GAS - 3-PIPE - ELECTRIC PAN",2,"THREE PHASE MOTOR","208-230/3/60",6,-20,120000,137200,"-",13750,"208-230/3/60",12.8,"208-230/1/60",1,16.7,16.7,4000,"7/8","3-1/8","-",15,20,"-","-",509,750,"N/A","N/A"]
["W6H120ETA","STANDARD","WAREHOUSE","HOT GAS - 3-PIPE - ELECTRIC PAN",2,"THREE PHASE MOTOR","208-230/3/60",6,-20,120000,137200,"-",13750,"208-230/3/60",8.1999999999999993,"208-230/1/60",1,16.7,16.7,4000,"7/8","3-1/8","-",15,20,"-","-",509,750,"N/A","N/A"]
["W6H120GHA","HIGH STATIC","WAREHOUSE","HOT GAS - 3-PIPE - ELECTRIC PAN",2,"THREE PHASE MOTOR","460/3/60",6,-20,120000,137200,"-",13750,"460/3/60",6.4,"460/1/60",1,8.6999999999999993,8.6999999999999993,4000,"7/8","3-1/8","-",15,20,"-","-",509,750,"N/A","N/A"]
["W6H120GTA","STANDARD","WAREHOUSE","HOT GAS - 3-PIPE - ELECTRIC PAN",2,"THREE PHASE MOTOR","460/3/60",6,-20,120000,137200,"-",13750,"460/3/60",4,"460/1/60",1,8.6999999999999993,8.6999999999999993,4000,"7/8","3-1/8","-",15,20,"-","-",509,750,"N/A","N/A"]
["W6H120JHA","HIGH STATIC","WAREHOUSE","HOT GAS - 3-PIPE - ELECTRIC PAN",2,"THREE PHASE MOTOR","575/3/60",6,-20,120000,137200,"-",13750,"575/3/60",6,"575/1/60",1,4,4,4000,"7/8","3-1/8","-",15,20,"-","-",509,750,"N/A","N/A"]
["W6H120JTA","STANDARD","WAREHOUSE","HOT GAS - 3-PIPE - ELECTRIC PAN",2,"THREE PHASE MOTOR","575/3/60",6,-20,120000,137200,"-",13750,"575/3/60",5,"575/1/60",1,4,4,4000,"7/8","3-1/8","-",15,20,"-","-",509,750,"N/A","N/A"]
["W6H143EHA","HIGH STATIC","WAREHOUSE","HOT GAS - 3-PIPE - ELECTRIC PAN",3,"THREE PHASE MOTOR","208-230/3/60",6,-20,143600,163100,"-",21040,"208-230/3/60",19.2,"208-230/1/60",1,25,25,6000,"1-1/8","3-1/8","-",20.8,25,"-","-",682,1030,"N/A","N/A"]
["W6H143ETA","STANDARD","WAREHOUSE","HOT GAS - 3-PIPE - ELECTRIC PAN",3,"THREE PHASE MOTOR","208-230/3/60",6,-20,143600,163100,"-",21040,"208-230/3/60",12.3,"208-230/1/60",1,25,25,6000,"1-1/8","3-1/8","-",15,20,"-","-",682,1030,"N/A","N/A"]
["W6H143GHA","HIGH STATIC","WAREHOUSE","HOT GAS - 3-PIPE - ELECTRIC PAN",3,"THREE PHASE MOTOR","460/3/60",6,-20,143600,163100,"-",21040,"460/3/60",9.6,"460/1/60",1,13,13,6000,"1-1/8","3-1/8","-",15,20,"-","-",682,1030,"N/A","N/A"]
["W6H143GTA","STANDARD","WAREHOUSE","HOT GAS - 3-PIPE - ELECTRIC PAN",3,"THREE PHASE MOTOR","460/3/60",6,-20,143600,163100,"-",21040,"460/3/60",6,"460/1/60",1,13,13,6000,"1-1/8","3-1/8","-",15,20,"-","-",682,1030,"N/A","N/A"]
["W6H143JHA","HIGH STATIC","WAREHOUSE","HOT GAS - 3-PIPE - ELECTRIC PAN",3,"THREE PHASE MOTOR","575/3/60",6,-20,143600,163100,"-",21040,"575/3/60",9,"575/1/60",1,6,6,6000,"1-1/8","3-1/8","-",15,20,"-","-",682,1030,"N/A","N/A"]
["W6H143JTA","STANDARD","WAREHOUSE","HOT GAS - 3-PIPE - ELECTRIC PAN",3,"THREE PHASE MOTOR","575/3/60",6,-20,143600,163100,"-",21040,"575/3/60",7.5,"575/1/60",1,6,6,6000,"1-1/8","3-1/8","-",15,20,"-","-",682,1030,"N/A","N/A"]
["W6H179EHA","HIGH STATIC","WAREHOUSE","HOT GAS - 3-PIPE - ELECTRIC PAN",3,"THREE PHASE MOTOR","208-230/3/60",6,-20,179500,206600,"-",20625,"208-230/3/60",19.2,"208-230/1/60",1,25,25,6000,"1-1/8","3-1/8","-",20.8,25,"-","-",682,1030,"N/A","N/A"]
["W6H179ETA","STANDARD","WAREHOUSE","HOT GAS - 3-PIPE - ELECTRIC PAN",3,"THREE PHASE MOTOR","208-230/3/60",6,-20,179500,206600,"-",20625,"208-230/3/60",12.3,"208-230/1/60",1,25,25,6000,"1-1/8","3-1/8","-",15,20,"-","-",682,1030,"N/A","N/A"]
["W6H179GHA","HIGH STATIC","WAREHOUSE","HOT GAS - 3-PIPE - ELECTRIC PAN",3,"THREE PHASE MOTOR","460/3/60",6,-20,179500,206600,"-",20625,"460/3/60",9.6,"460/1/60",1,13,13,6000,"1-1/8","3-1/8","-",15,20,"-","-",682,1030,"N/A","N/A"]
["W6H179GTA","STANDARD","WAREHOUSE","HOT GAS - 3-PIPE - ELECTRIC PAN",3,"THREE PHASE MOTOR","460/3/60",6,-20,179500,206600,"-",20625,"460/3/60",6,"460/1/60",1,13,13,6000,"1-1/8","3-1/8","-",15,20,"-","-",682,1030,"N/A","N/A"]
["W6H179JHA","HIGH STATIC","WAREHOUSE","HOT GAS - 3-PIPE - ELECTRIC PAN",3,"THREE PHASE MOTOR","575/3/60",6,-20,179500,206600,"-",20625,"575/3/60",9,"575/1/60",1,6,6,6000,"1-1/8","3-1/8","-",15,20,"-","-",682,1030,"N/A","N/A"]
["W6H179JTA","STANDARD","WAREHOUSE","HOT GAS - 3-PIPE - ELECTRIC PAN",3,"THREE PHASE MOTOR","575/3/60",6,-20,179500,206600,"-",20625,"575/3/60",7.5,"575/1/60",1,6,6,6000,"1-1/8","3-1/8","-",15,20,"-","-",682,1030,"N/A","N/A"]
["W6H216EHA","HIGH STATIC","WAREHOUSE","HOT GAS - 3-PIPE - ELECTRIC PAN",4,"THREE PHASE MOTOR","208-230/3/60",6,-20,216200,246100,"-",27500,"208-230/3/60",25.6,"208-230/1/60",1,33.299999999999997,33.299999999999997,8000,"1-1/8","3-1/8","-",27.2,30,"-","-",1050,1360,"N/A","N/A"]
["W6H216ETA","STANDARD","WAREHOUSE","HOT GAS - 3-PIPE - ELECTRIC PAN",4,"THREE PHASE MOTOR","208-230/3/60",6,-20,216200,246100,"-",27500,"208-230/3/60",16.399999999999999,"208-230/1/60",1,33.299999999999997,33.299999999999997,8000,"1-1/8","3-1/8","-",17.399999999999999,20,"-","-",1050,1360,"N/A","N/A"]
["W6H216GHA","HIGH STATIC","WAREHOUSE","HOT GAS - 3-PIPE - ELECTRIC PAN",4,"THREE PHASE MOTOR","460/3/60",6,-20,216200,246100,"-",27500,"460/3/60",12.8,"460/1/60",1,17.399999999999999,17.399999999999999,8000,"1-1/8","3-1/8","-",15,20,"-","-",1050,1360,"N/A","N/A"]
["W6H216GTA","STANDARD","WAREHOUSE","HOT GAS - 3-PIPE - ELECTRIC PAN",4,"THREE PHASE MOTOR","460/3/60",6,-20,216200,246100,"-",27500,"460/3/60",8,"460/1/60",1,17.399999999999999,17.399999999999999,8000,"1-1/8","3-1/8","-",15,20,"-","-",1050,1360,"N/A","N/A"]
["W6H216JHA","HIGH STATIC","WAREHOUSE","HOT GAS - 3-PIPE - ELECTRIC PAN",4,"THREE PHASE MOTOR","575/3/60",6,-20,216200,246100,"-",27500,"575/3/60",12,"575/1/60",1,8,8,8000,"1-1/8","3-1/8","-",15,20,"-","-",1050,1360,"N/A","N/A"]
["W6H216JTA","STANDARD","WAREHOUSE","HOT GAS - 3-PIPE - ELECTRIC PAN",4,"THREE PHASE MOTOR","575/3/60",6,-20,216200,246100,"-",27500,"575/3/60",10,"575/1/60",1,8,8,8000,"1-1/8","3-1/8","-",15,20,"-","-",1050,1360,"N/A","N/A"]
["W6K036EHA","HIGH STATIC","WAREHOUSE","HOT GAS - 3-PIPE - HOT GAS PAN",1,"THREE PHASE MOTOR","208-230/3/60",6,-20,36400,41900,"-",7080,"208-230/3/60",6.4,"-","-","-","-","-","1/2","2-1/8",1.125,15,20,"-","-",303,480,"N/A","N/A"]
["W6K036ETA","STANDARD","WAREHOUSE","HOT GAS - 3-PIPE - HOT GAS PAN",1,"THREE PHASE MOTOR","208-230/3/60",6,-20,36400,41900,"-",7080,"208-230/3/60",4.0999999999999996,"-","-","-","-","-","1/2","2-1/8",1.125,15,20,"-","-",303,480,"N/A","N/A"]
["W6K036GHA","HIGH STATIC","WAREHOUSE","HOT GAS - 3-PIPE - HOT GAS PAN",1,"THREE PHASE MOTOR","460/3/60",6,-20,36400,41900,"-",7080,"460/3/60",3.2,"-","-","-","-","-","1/2","2-1/8",1.125,15,20,"-","-",303,480,"N/A","N/A"]
["W6K036GTA","STANDARD","WAREHOUSE","HOT GAS - 3-PIPE - HOT GAS PAN",1,"THREE PHASE MOTOR","460/3/60",6,-20,36400,41900,"-",7080,"460/3/60",2,"-","-","-","-","-","1/2","2-1/8",1.125,15,20,"-","-",303,480,"N/A","N/A"]
["W6K036JHA","HIGH STATIC","WAREHOUSE","HOT GAS - 3-PIPE - HOT GAS PAN",1,"THREE PHASE MOTOR","575/3/60",6,-20,36400,41900,"-",7080,"575/3/60",3,"-","-","-","-","-","1/2","2-1/8",1.125,15,20,"-","-",303,480,"N/A","N/A"]
["W6K036JTA","STANDARD","WAREHOUSE","HOT GAS - 3-PIPE - HOT GAS PAN",1,"THREE PHASE MOTOR","575/3/60",6,-20,36400,41900,"-",7080,"575/3/60",2.5,"-","-","-","-","-","1/2","2-1/8",1.125,15,20,"-","-",303,480,"N/A","N/A"]
["W6K047EHA","HIGH STATIC","WAREHOUSE","HOT GAS - 3-PIPE - HOT GAS PAN",1,"THREE PHASE MOTOR","208-230/3/60",6,-20,47900,54600,"-",7010,"208-230/3/60",6.4,"-","-","-","-","-","5/8","2-1/8",1.125,15,20,"-","-",303,480,"N/A","N/A"]
["W6K047ETA","STANDARD","WAREHOUSE","HOT GAS - 3-PIPE - HOT GAS PAN",1,"THREE PHASE MOTOR","208-230/3/60",6,-20,47900,54600,"-",7010,"208-230/3/60",4.0999999999999996,"-","-","-","-","-","5/8","2-1/8",1.125,15,20,"-","-",303,480,"N/A","N/A"]
["W6K047GHA","HIGH STATIC","WAREHOUSE","HOT GAS - 3-PIPE - HOT GAS PAN",1,"THREE PHASE MOTOR","460/3/60",6,-20,47900,54600,"-",7010,"460/3/60",3.2,"-","-","-","-","-","5/8","2-1/8",1.125,15,20,"-","-",303,480,"N/A","N/A"]
["W6K047GTA","STANDARD","WAREHOUSE","HOT GAS - 3-PIPE - HOT GAS PAN",1,"THREE PHASE MOTOR","460/3/60",6,-20,47900,54600,"-",7010,"460/3/60",2,"-","-","-","-","-","5/8","2-1/8",1.125,15,20,"-","-",303,480,"N/A","N/A"]
["W6K047JHA","HIGH STATIC","WAREHOUSE","HOT GAS - 3-PIPE - HOT GAS PAN",1,"THREE PHASE MOTOR","575/3/60",6,-20,47900,54600,"-",7010,"575/3/60",3,"-","-","-","-","-","5/8","2-1/8",1.125,15,20,"-","-",303,480,"N/A","N/A"]
["W6K047JTA","STANDARD","WAREHOUSE","HOT GAS - 3-PIPE - HOT GAS PAN",1,"THREE PHASE MOTOR","575/3/60",6,-20,47900,54600,"-",7010,"575/3/60",2.5,"-","-","-","-","-","5/8","2-1/8",1.125,15,20,"-","-",303,480,"N/A","N/A"]
["W6K059EHA","HIGH STATIC","WAREHOUSE","HOT GAS - 3-PIPE - HOT GAS PAN",1,"THREE PHASE MOTOR","208-230/3/60",6,-20,59200,67900,"-",6875,"208-230/3/60",6.4,"-","-","-","-","-","5/8","2-1/8",1.125,15,20,"-","-",303,480,"N/A","N/A"]
["W6K059ETA","STANDARD","WAREHOUSE","HOT GAS - 3-PIPE - HOT GAS PAN",1,"THREE PHASE MOTOR","208-230/3/60",6,-20,59200,67900,"-",6875,"208-230/3/60",4.0999999999999996,"-","-","-","-","-","5/8","2-1/8",1.125,15,20,"-","-",303,480,"N/A","N/A"]
["W6K059GHA","HIGH STATIC","WAREHOUSE","HOT GAS - 3-PIPE - HOT GAS PAN",1,"THREE PHASE MOTOR","460/3/60",6,-20,59200,67900,"-",6875,"460/3/60",3.2,"-","-","-","-","-","5/8","2-1/8",1.125,15,20,"-","-",303,480,"N/A","N/A"]
["W6K059GTA","STANDARD","WAREHOUSE","HOT GAS - 3-PIPE - HOT GAS PAN",1,"THREE PHASE MOTOR","460/3/60",6,-20,59200,67900,"-",6875,"460/3/60",2,"-","-","-","-","-","5/8","2-1/8",1.125,15,20,"-","-",303,480,"N/A","N/A"]
["W6K059JHA","HIGH STATIC","WAREHOUSE","HOT GAS - 3-PIPE - HOT GAS PAN",1,"THREE PHASE MOTOR","575/3/60",6,-20,59200,67900,"-",6875,"575/3/60",3,"-","-","-","-","-","5/8","2-1/8",1.125,15,20,"-","-",303,480,"N/A","N/A"]
["W6K059JTA","STANDARD","WAREHOUSE","HOT GAS - 3-PIPE - HOT GAS PAN",1,"THREE PHASE MOTOR","575/3/60",6,-20,59200,67900,"-",6875,"575/3/60",2.5,"-","-","-","-","-","5/8","2-1/8",1.125,15,20,"-","-",303,480,"N/A","N/A"]
["W6K072EHA","HIGH STATIC","WAREHOUSE","HOT GAS - 3-PIPE - HOT GAS PAN",2,"THREE PHASE MOTOR","208-230/3/60",6,-20,72500,83500,"-",14160,"208-230/3/60",12.8,"-","-","-","-","-","5/8","2-1/8",1.125,15,20,"-","-",509,750,"N/A","N/A"]
["W6K072ETA","STANDARD","WAREHOUSE","HOT GAS - 3-PIPE - HOT GAS PAN",2,"THREE PHASE MOTOR","208-230/3/60",6,-20,72500,83500,"-",14160,"208-230/3/60",8.1999999999999993,"-","-","-","-","-","5/8","2-1/8",1.125,15,20,"-","-",509,750,"N/A","N/A"]
["W6K072GHA","HIGH STATIC","WAREHOUSE","HOT GAS - 3-PIPE - HOT GAS PAN",2,"THREE PHASE MOTOR","460/3/60",6,-20,72500,83500,"-",14160,"460/3/60",6.4,"-","-","-","-","-","5/8","2-1/8",1.125,15,20,"-","-",509,750,"N/A","N/A"]
["W6K072GTA","STANDARD","WAREHOUSE","HOT GAS - 3-PIPE - HOT GAS PAN",2,"THREE PHASE MOTOR","460/3/60",6,-20,72500,83500,"-",14160,"460/3/60",4,"-","-","-","-","-","5/8","2-1/8",1.125,15,20,"-","-",509,750,"N/A","N/A"]
["W6K072JHA","HIGH STATIC","WAREHOUSE","HOT GAS - 3-PIPE - HOT GAS PAN",2,"THREE PHASE MOTOR","575/3/60",6,-20,72500,83500,"-",14160,"575/3/60",6,"-","-","-","-","-","5/8","2-1/8",1.125,15,20,"-","-",509,750,"N/A","N/A"]
["W6K072JTA","STANDARD","WAREHOUSE","HOT GAS - 3-PIPE - HOT GAS PAN",2,"THREE PHASE MOTOR","575/3/60",6,-20,72500,83500,"-",14160,"575/3/60",5,"-","-","-","-","-","5/8","2-1/8",1.125,15,20,"-","-",509,750,"N/A","N/A"]
["W6K096EHA","HIGH STATIC","WAREHOUSE","HOT GAS - 3-PIPE - HOT GAS PAN",2,"THREE PHASE MOTOR","208-230/3/60",6,-20,96100,109400,"-",14030,"208-230/3/60",12.8,"-","-","-","-","-","7/8","3-1/8",1.125,15,20,"-","-",509,750,"N/A","N/A"]
["W6K096ETA","STANDARD","WAREHOUSE","HOT GAS - 3-PIPE - HOT GAS PAN",2,"THREE PHASE MOTOR","208-230/3/60",6,-20,96100,109400,"-",14030,"208-230/3/60",8.1999999999999993,"-","-","-","-","-","7/8","3-1/8",1.125,15,20,"-","-",509,750,"N/A","N/A"]
["W6K096GHA","HIGH STATIC","WAREHOUSE","HOT GAS - 3-PIPE - HOT GAS PAN",2,"THREE PHASE MOTOR","460/3/60",6,-20,96100,109400,"-",14030,"460/3/60",6.4,"-","-","-","-","-","7/8","3-1/8",1.125,15,20,"-","-",509,750,"N/A","N/A"]
["W6K096GTA","STANDARD","WAREHOUSE","HOT GAS - 3-PIPE - HOT GAS PAN",2,"THREE PHASE MOTOR","460/3/60",6,-20,96100,109400,"-",14030,"460/3/60",4,"-","-","-","-","-","7/8","3-1/8",1.125,15,20,"-","-",509,750,"N/A","N/A"]
["W6K096JHA","HIGH STATIC","WAREHOUSE","HOT GAS - 3-PIPE - HOT GAS PAN",2,"THREE PHASE MOTOR","575/3/60",6,-20,96100,109400,"-",14030,"575/3/60",6,"-","-","-","-","-","7/8","3-1/8",1.125,15,20,"-","-",509,750,"N/A","N/A"]
["W6K096JTA","STANDARD","WAREHOUSE","HOT GAS - 3-PIPE - HOT GAS PAN",2,"THREE PHASE MOTOR","575/3/60",6,-20,96100,109400,"-",14030,"575/3/60",5,"-","-","-","-","-","7/8","3-1/8",1.125,15,20,"-","-",509,750,"N/A","N/A"]
["W6K120EHA","HIGH STATIC","WAREHOUSE","HOT GAS - 3-PIPE - HOT GAS PAN",2,"THREE PHASE MOTOR","208-230/3/60",6,-20,120000,137200,"-",13750,"208-230/3/60",12.8,"-","-","-","-","-","7/8","3-1/8",1.125,15,20,"-","-",509,750,"N/A","N/A"]
["W6K120ETA","STANDARD","WAREHOUSE","HOT GAS - 3-PIPE - HOT GAS PAN",2,"THREE PHASE MOTOR","208-230/3/60",6,-20,120000,137200,"-",13750,"208-230/3/60",8.1999999999999993,"-","-","-","-","-","7/8","3-1/8",1.125,15,20,"-","-",509,750,"N/A","N/A"]
["W6K120GHA","HIGH STATIC","WAREHOUSE","HOT GAS - 3-PIPE - HOT GAS PAN",2,"THREE PHASE MOTOR","460/3/60",6,-20,120000,137200,"-",13750,"460/3/60",6.4,"-","-","-","-","-","7/8","3-1/8",1.125,15,20,"-","-",509,750,"N/A","N/A"]
["W6K120GTA","STANDARD","WAREHOUSE","HOT GAS - 3-PIPE - HOT GAS PAN",2,"THREE PHASE MOTOR","460/3/60",6,-20,120000,137200,"-",13750,"460/3/60",4,"-","-","-","-","-","7/8","3-1/8",1.125,15,20,"-","-",509,750,"N/A","N/A"]
["W6K120JHA","HIGH STATIC","WAREHOUSE","HOT GAS - 3-PIPE - HOT GAS PAN",2,"THREE PHASE MOTOR","575/3/60",6,-20,120000,137200,"-",13750,"575/3/60",6,"-","-","-","-","-","7/8","3-1/8",1.125,15,20,"-","-",509,750,"N/A","N/A"]
["W6K120JTA","STANDARD","WAREHOUSE","HOT GAS - 3-PIPE - HOT GAS PAN",2,"THREE PHASE MOTOR","575/3/60",6,-20,120000,137200,"-",13750,"575/3/60",5,"-","-","-","-","-","7/8","3-1/8",1.125,15,20,"-","-",509,750,"N/A","N/A"]
["W6K143EHA","HIGH STATIC","WAREHOUSE","HOT GAS - 3-PIPE - HOT GAS PAN",3,"THREE PHASE MOTOR","208-230/3/60",6,-20,143600,163100,"-",21040,"208-230/3/60",19.2,"-","-","-","-","-","1-1/8","3-1/8",1.375,20.8,25,"-","-",682,1030,"N/A","N/A"]
["W6K143ETA","STANDARD","WAREHOUSE","HOT GAS - 3-PIPE - HOT GAS PAN",3,"THREE PHASE MOTOR","208-230/3/60",6,-20,143600,163100,"-",21040,"208-230/3/60",12.3,"-","-","-","-","-","1-1/8","3-1/8",1.375,15,20,"-","-",682,1030,"N/A","N/A"]
["W6K143GHA","HIGH STATIC","WAREHOUSE","HOT GAS - 3-PIPE - HOT GAS PAN",3,"THREE PHASE MOTOR","460/3/60",6,-20,143600,163100,"-",21040,"460/3/60",9.6,"-","-","-","-","-","1-1/8","3-1/8",1.375,15,20,"-","-",682,1030,"N/A","N/A"]
["W6K143GTA","STANDARD","WAREHOUSE","HOT GAS - 3-PIPE - HOT GAS PAN",3,"THREE PHASE MOTOR","460/3/60",6,-20,143600,163100,"-",21040,"460/3/60",6,"-","-","-","-","-","1-1/8","3-1/8",1.375,15,20,"-","-",682,1030,"N/A","N/A"]
["W6K143JHA","HIGH STATIC","WAREHOUSE","HOT GAS - 3-PIPE - HOT GAS PAN",3,"THREE PHASE MOTOR","575/3/60",6,-20,143600,163100,"-",21040,"575/3/60",9,"-","-","-","-","-","1-1/8","3-1/8",1.375,15,20,"-","-",682,1030,"N/A","N/A"]
["W6K143JTA","STANDARD","WAREHOUSE","HOT GAS - 3-PIPE - HOT GAS PAN",3,"THREE PHASE MOTOR","575/3/60",6,-20,143600,163100,"-",21040,"575/3/60",7.5,"-","-","-","-","-","1-1/8","3-1/8",1.375,15,20,"-","-",682,1030,"N/A","N/A"]
["W6K179EHA","HIGH STATIC","WAREHOUSE","HOT GAS - 3-PIPE - HOT GAS PAN",3,"THREE PHASE MOTOR","208-230/3/60",6,-20,179500,206600,"-",20625,"208-230/3/60",19.2,"-","-","-","-","-","1-1/8","3-1/8",1.375,20.8,25,"-","-",682,1030,"N/A","N/A"]
["W6K179ETA","STANDARD","WAREHOUSE","HOT GAS - 3-PIPE - HOT GAS PAN",3,"THREE PHASE MOTOR","208-230/3/60",6,-20,179500,206600,"-",20625,"208-230/3/60",12.3,"-","-","-","-","-","1-1/8","3-1/8",1.375,15,20,"-","-",682,1030,"N/A","N/A"]
["W6K179GHA","HIGH STATIC","WAREHOUSE","HOT GAS - 3-PIPE - HOT GAS PAN",3,"THREE PHASE MOTOR","460/3/60",6,-20,179500,206600,"-",20625,"460/3/60",9.6,"-","-","-","-","-","1-1/8","3-1/8",1.375,15,20,"-","-",682,1030,"N/A","N/A"]
["W6K179GTA","STANDARD","WAREHOUSE","HOT GAS - 3-PIPE - HOT GAS PAN",3,"THREE PHASE MOTOR","460/3/60",6,-20,179500,206600,"-",20625,"460/3/60",6,"-","-","-","-","-","1-1/8","3-1/8",1.375,15,20,"-","-",682,1030,"N/A","N/A"]
["W6K179JHA","HIGH STATIC","WAREHOUSE","HOT GAS - 3-PIPE - HOT GAS PAN",3,"THREE PHASE MOTOR","575/3/60",6,-20,179500,206600,"-",20625,"575/3/60",9,"-","-","-","-","-","1-1/8","3-1/8",1.375,15,20,"-","-",682,1030,"N/A","N/A"]
["W6K179JTA","STANDARD","WAREHOUSE","HOT GAS - 3-PIPE - HOT GAS PAN",3,"THREE PHASE MOTOR","575/3/60",6,-20,179500,206600,"-",20625,"575/3/60",7.5,"-","-","-","-","-","1-1/8","3-1/8",1.375,15,20,"-","-",682,1030,"N/A","N/A"]
["W6K216EHA","HIGH STATIC","WAREHOUSE","HOT GAS - 3-PIPE - HOT GAS PAN",4,"THREE PHASE MOTOR","208-230/3/60",6,-20,216200,246100,"-",27500,"208-230/3/60",25.6,"-","-","-","-","-","1-1/8","3-1/8",1.375,27.2,30,"-","-",1050,1360,"N/A","N/A"]
["W6K216ETA","STANDARD","WAREHOUSE","HOT GAS - 3-PIPE - HOT GAS PAN",4,"THREE PHASE MOTOR","208-230/3/60",6,-20,216200,246100,"-",27500,"208-230/3/60",16.399999999999999,"-","-","-","-","-","1-1/8","3-1/8",1.375,17.399999999999999,20,"-","-",1050,1360,"N/A","N/A"]
["W6K216GHA","HIGH STATIC","WAREHOUSE","HOT GAS - 3-PIPE - HOT GAS PAN",4,"THREE PHASE MOTOR","460/3/60",6,-20,216200,246100,"-",27500,"460/3/60",12.8,"-","-","-","-","-","1-1/8","3-1/8",1.375,15,20,"-","-",1050,1360,"N/A","N/A"]
["W6K216GTA","STANDARD","WAREHOUSE","HOT GAS - 3-PIPE - HOT GAS PAN",4,"THREE PHASE MOTOR","460/3/60",6,-20,216200,246100,"-",27500,"460/3/60",8,"-","-","-","-","-","1-1/8","3-1/8",1.375,15,20,"-","-",1050,1360,"N/A","N/A"]
["W6K216JHA","HIGH STATIC","WAREHOUSE","HOT GAS - 3-PIPE - HOT GAS PAN",4,"THREE PHASE MOTOR","575/3/60",6,-20,216200,246100,"-",27500,"575/3/60",12,"-","-","-","-","-","1-1/8","3-1/8",1.375,15,20,"-","-",1050,1360,"N/A","N/A"]
["W6K216JTA","STANDARD","WAREHOUSE","HOT GAS - 3-PIPE - HOT GAS PAN",4,"THREE PHASE MOTOR","575/3/60",6,-20,216200,246100,"-",27500,"575/3/60",10,"-","-","-","-","-","1-1/8","3-1/8",1.375,15,20,"-","-",1050,1360,"N/A","N/A"]
["W6L036EHA","HIGH STATIC","WAREHOUSE","HOT GAS - REVERSE CYCLE - HOT GAS PAN",1,"THREE PHASE MOTOR","208-230/3/60",6,-20,36400,41900,"-",7080,"208-230/3/60",6.4,"-","-","-","-","-","1/2","2-1/8",1.125,15,20,"-","-",303,480,"N/A","N/A"]
["W6L036ETA","STANDARD","WAREHOUSE","HOT GAS - REVERSE CYCLE - HOT GAS PAN",1,"THREE PHASE MOTOR","208-230/3/60",6,-20,36400,41900,"-",7080,"208-230/3/60",4.0999999999999996,"-","-","-","-","-","1/2","2-1/8",1.125,15,20,"-","-",303,480,"N/A","N/A"]
["W6L036GHA","HIGH STATIC","WAREHOUSE","HOT GAS - REVERSE CYCLE - HOT GAS PAN",1,"THREE PHASE MOTOR","460/3/60",6,-20,36400,41900,"-",7080,"460/3/60",3.2,"-","-","-","-","-","1/2","2-1/8",1.125,15,20,"-","-",303,480,"N/A","N/A"]
["W6L036GTA","STANDARD","WAREHOUSE","HOT GAS - REVERSE CYCLE - HOT GAS PAN",1,"THREE PHASE MOTOR","460/3/60",6,-20,36400,41900,"-",7080,"460/3/60",2,"-","-","-","-","-","1/2","2-1/8",1.125,15,20,"-","-",303,480,"N/A","N/A"]
["W6L036JHA","HIGH STATIC","WAREHOUSE","HOT GAS - REVERSE CYCLE - HOT GAS PAN",1,"THREE PHASE MOTOR","575/3/60",6,-20,36400,41900,"-",7080,"575/3/60",3,"-","-","-","-","-","1/2","2-1/8",1.125,15,20,"-","-",303,480,"N/A","N/A"]
["W6L036JTA","STANDARD","WAREHOUSE","HOT GAS - REVERSE CYCLE - HOT GAS PAN",1,"THREE PHASE MOTOR","575/3/60",6,-20,36400,41900,"-",7080,"575/3/60",2.5,"-","-","-","-","-","1/2","2-1/8",1.125,15,20,"-","-",303,480,"N/A","N/A"]
["W6L047EHA","HIGH STATIC","WAREHOUSE","HOT GAS - REVERSE CYCLE - HOT GAS PAN",1,"THREE PHASE MOTOR","208-230/3/60",6,-20,47900,54600,"-",7010,"208-230/3/60",6.4,"-","-","-","-","-","5/8","2-1/8",1.125,15,20,"-","-",303,480,"N/A","N/A"]
["W6L047ETA","STANDARD","WAREHOUSE","HOT GAS - REVERSE CYCLE - HOT GAS PAN",1,"THREE PHASE MOTOR","208-230/3/60",6,-20,47900,54600,"-",7010,"208-230/3/60",4.0999999999999996,"-","-","-","-","-","5/8","2-1/8",1.125,15,20,"-","-",303,480,"N/A","N/A"]
["W6L047GHA","HIGH STATIC","WAREHOUSE","HOT GAS - REVERSE CYCLE - HOT GAS PAN",1,"THREE PHASE MOTOR","460/3/60",6,-20,47900,54600,"-",7010,"460/3/60",3.2,"-","-","-","-","-","5/8","2-1/8",1.125,15,20,"-","-",303,480,"N/A","N/A"]
["W6L047GTA","STANDARD","WAREHOUSE","HOT GAS - REVERSE CYCLE - HOT GAS PAN",1,"THREE PHASE MOTOR","460/3/60",6,-20,47900,54600,"-",7010,"460/3/60",2,"-","-","-","-","-","5/8","2-1/8",1.125,15,20,"-","-",303,480,"N/A","N/A"]
["W6L047JHA","HIGH STATIC","WAREHOUSE","HOT GAS - REVERSE CYCLE - HOT GAS PAN",1,"THREE PHASE MOTOR","575/3/60",6,-20,47900,54600,"-",7010,"575/3/60",3,"-","-","-","-","-","5/8","2-1/8",1.125,15,20,"-","-",303,480,"N/A","N/A"]
["W6L047JTA","STANDARD","WAREHOUSE","HOT GAS - REVERSE CYCLE - HOT GAS PAN",1,"THREE PHASE MOTOR","575/3/60",6,-20,47900,54600,"-",7010,"575/3/60",2.5,"-","-","-","-","-","5/8","2-1/8",1.125,15,20,"-","-",303,480,"N/A","N/A"]
["W6L059EHA","HIGH STATIC","WAREHOUSE","HOT GAS - REVERSE CYCLE - HOT GAS PAN",1,"THREE PHASE MOTOR","208-230/3/60",6,-20,59200,67900,"-",6875,"208-230/3/60",6.4,"-","-","-","-","-","5/8","2-1/8",1.125,15,20,"-","-",303,480,"N/A","N/A"]
["W6L059ETA","STANDARD","WAREHOUSE","HOT GAS - REVERSE CYCLE - HOT GAS PAN",1,"THREE PHASE MOTOR","208-230/3/60",6,-20,59200,67900,"-",6875,"208-230/3/60",4.0999999999999996,"-","-","-","-","-","5/8","2-1/8",1.125,15,20,"-","-",303,480,"N/A","N/A"]
["W6L059GHA","HIGH STATIC","WAREHOUSE","HOT GAS - REVERSE CYCLE - HOT GAS PAN",1,"THREE PHASE MOTOR","460/3/60",6,-20,59200,67900,"-",6875,"460/3/60",3.2,"-","-","-","-","-","5/8","2-1/8",1.125,15,20,"-","-",303,480,"N/A","N/A"]
["W6L059GTA","STANDARD","WAREHOUSE","HOT GAS - REVERSE CYCLE - HOT GAS PAN",1,"THREE PHASE MOTOR","460/3/60",6,-20,59200,67900,"-",6875,"460/3/60",2,"-","-","-","-","-","5/8","2-1/8",1.125,15,20,"-","-",303,480,"N/A","N/A"]
["W6L059JHA","HIGH STATIC","WAREHOUSE","HOT GAS - REVERSE CYCLE - HOT GAS PAN",1,"THREE PHASE MOTOR","575/3/60",6,-20,59200,67900,"-",6875,"575/3/60",3,"-","-","-","-","-","5/8","2-1/8",1.125,15,20,"-","-",303,480,"N/A","N/A"]
["W6L059JTA","STANDARD","WAREHOUSE","HOT GAS - REVERSE CYCLE - HOT GAS PAN",1,"THREE PHASE MOTOR","575/3/60",6,-20,59200,67900,"-",6875,"575/3/60",2.5,"-","-","-","-","-","5/8","2-1/8",1.125,15,20,"-","-",303,480,"N/A","N/A"]
["W6L072EHA","HIGH STATIC","WAREHOUSE","HOT GAS - REVERSE CYCLE - HOT GAS PAN",2,"THREE PHASE MOTOR","208-230/3/60",6,-20,72500,83500,"-",14160,"208-230/3/60",12.8,"-","-","-","-","-","5/8","2-1/8",1.125,15,20,"-","-",509,750,"N/A","N/A"]
["W6L072ETA","STANDARD","WAREHOUSE","HOT GAS - REVERSE CYCLE - HOT GAS PAN",2,"THREE PHASE MOTOR","208-230/3/60",6,-20,72500,83500,"-",14160,"208-230/3/60",8.1999999999999993,"-","-","-","-","-","5/8","2-1/8",1.125,15,20,"-","-",509,750,"N/A","N/A"]
["W6L072GHA","HIGH STATIC","WAREHOUSE","HOT GAS - REVERSE CYCLE - HOT GAS PAN",2,"THREE PHASE MOTOR","460/3/60",6,-20,72500,83500,"-",14160,"460/3/60",6.4,"-","-","-","-","-","5/8","2-1/8",1.125,15,20,"-","-",509,750,"N/A","N/A"]
["W6L072GTA","STANDARD","WAREHOUSE","HOT GAS - REVERSE CYCLE - HOT GAS PAN",2,"THREE PHASE MOTOR","460/3/60",6,-20,72500,83500,"-",14160,"460/3/60",4,"-","-","-","-","-","5/8","2-1/8",1.125,15,20,"-","-",509,750,"N/A","N/A"]
["W6L072JHA","HIGH STATIC","WAREHOUSE","HOT GAS - REVERSE CYCLE - HOT GAS PAN",2,"THREE PHASE MOTOR","575/3/60",6,-20,72500,83500,"-",14160,"575/3/60",6,"-","-","-","-","-","5/8","2-1/8",1.125,15,20,"-","-",509,750,"N/A","N/A"]
["W6L072JTA","STANDARD","WAREHOUSE","HOT GAS - REVERSE CYCLE - HOT GAS PAN",2,"THREE PHASE MOTOR","575/3/60",6,-20,72500,83500,"-",14160,"575/3/60",5,"-","-","-","-","-","5/8","2-1/8",1.125,15,20,"-","-",509,750,"N/A","N/A"]
["W6L096EHA","HIGH STATIC","WAREHOUSE","HOT GAS - REVERSE CYCLE - HOT GAS PAN",2,"THREE PHASE MOTOR","208-230/3/60",6,-20,96100,109400,"-",14030,"208-230/3/60",12.8,"-","-","-","-","-","7/8","3-1/8",1.125,15,20,"-","-",509,750,"N/A","N/A"]
["W6L096ETA","STANDARD","WAREHOUSE","HOT GAS - REVERSE CYCLE - HOT GAS PAN",2,"THREE PHASE MOTOR","208-230/3/60",6,-20,96100,109400,"-",14030,"208-230/3/60",8.1999999999999993,"-","-","-","-","-","7/8","3-1/8",1.125,15,20,"-","-",509,750,"N/A","N/A"]
["W6L096GHA","HIGH STATIC","WAREHOUSE","HOT GAS - REVERSE CYCLE - HOT GAS PAN",2,"THREE PHASE MOTOR","460/3/60",6,-20,96100,109400,"-",14030,"460/3/60",6.4,"-","-","-","-","-","7/8","3-1/8",1.125,15,20,"-","-",509,750,"N/A","N/A"]
["W6L096GTA","STANDARD","WAREHOUSE","HOT GAS - REVERSE CYCLE - HOT GAS PAN",2,"THREE PHASE MOTOR","460/3/60",6,-20,96100,109400,"-",14030,"460/3/60",4,"-","-","-","-","-","7/8","3-1/8",1.125,15,20,"-","-",509,750,"N/A","N/A"]
["W6L096JHA","HIGH STATIC","WAREHOUSE","HOT GAS - REVERSE CYCLE - HOT GAS PAN",2,"THREE PHASE MOTOR","575/3/60",6,-20,96100,109400,"-",14030,"575/3/60",6,"-","-","-","-","-","7/8","3-1/8",1.125,15,20,"-","-",509,750,"N/A","N/A"]
["W6L096JTA","STANDARD","WAREHOUSE","HOT GAS - REVERSE CYCLE - HOT GAS PAN",2,"THREE PHASE MOTOR","575/3/60",6,-20,96100,109400,"-",14030,"575/3/60",5,"-","-","-","-","-","7/8","3-1/8",1.125,15,20,"-","-",509,750,"N/A","N/A"]
["W6L120EHA","HIGH STATIC","WAREHOUSE","HOT GAS - REVERSE CYCLE - HOT GAS PAN",2,"THREE PHASE MOTOR","208-230/3/60",6,-20,120000,137200,"-",13750,"208-230/3/60",12.8,"-","-","-","-","-","7/8","3-1/8",1.125,15,20,"-","-",509,750,"N/A","N/A"]
["W6L120ETA","STANDARD","WAREHOUSE","HOT GAS - REVERSE CYCLE - HOT GAS PAN",2,"THREE PHASE MOTOR","208-230/3/60",6,-20,120000,137200,"-",13750,"208-230/3/60",8.1999999999999993,"-","-","-","-","-","7/8","3-1/8",1.125,15,20,"-","-",509,750,"N/A","N/A"]
["W6L120GHA","HIGH STATIC","WAREHOUSE","HOT GAS - REVERSE CYCLE - HOT GAS PAN",2,"THREE PHASE MOTOR","460/3/60",6,-20,120000,137200,"-",13750,"460/3/60",6.4,"-","-","-","-","-","7/8","3-1/8",1.125,15,20,"-","-",509,750,"N/A","N/A"]
["W6L120GTA","STANDARD","WAREHOUSE","HOT GAS - REVERSE CYCLE - HOT GAS PAN",2,"THREE PHASE MOTOR","460/3/60",6,-20,120000,137200,"-",13750,"460/3/60",4,"-","-","-","-","-","7/8","3-1/8",1.125,15,20,"-","-",509,750,"N/A","N/A"]
["W6L120JHA","HIGH STATIC","WAREHOUSE","HOT GAS - REVERSE CYCLE - HOT GAS PAN",2,"THREE PHASE MOTOR","575/3/60",6,-20,120000,137200,"-",13750,"575/3/60",6,"-","-","-","-","-","7/8","3-1/8",1.125,15,20,"-","-",509,750,"N/A","N/A"]
["W6L120JTA","STANDARD","WAREHOUSE","HOT GAS - REVERSE CYCLE - HOT GAS PAN",2,"THREE PHASE MOTOR","575/3/60",6,-20,120000,137200,"-",13750,"575/3/60",5,"-","-","-","-","-","7/8","3-1/8",1.125,15,20,"-","-",509,750,"N/A","N/A"]
["W6L143EHA","HIGH STATIC","WAREHOUSE","HOT GAS - REVERSE CYCLE - HOT GAS PAN",3,"THREE PHASE MOTOR","208-230/3/60",6,-20,143600,163100,"-",21040,"208-230/3/60",19.2,"-","-","-","-","-","1-1/8","3-1/8",1.375,20.8,25,"-","-",682,1030,"N/A","N/A"]
["W6L143ETA","STANDARD","WAREHOUSE","HOT GAS - REVERSE CYCLE - HOT GAS PAN",3,"THREE PHASE MOTOR","208-230/3/60",6,-20,143600,163100,"-",21040,"208-230/3/60",12.3,"-","-","-","-","-","1-1/8","3-1/8",1.375,15,20,"-","-",682,1030,"N/A","N/A"]
["W6L143GHA","HIGH STATIC","WAREHOUSE","HOT GAS - REVERSE CYCLE - HOT GAS PAN",3,"THREE PHASE MOTOR","460/3/60",6,-20,143600,163100,"-",21040,"460/3/60",9.6,"-","-","-","-","-","1-1/8","3-1/8",1.375,15,20,"-","-",682,1030,"N/A","N/A"]
["W6L143GTA","STANDARD","WAREHOUSE","HOT GAS - REVERSE CYCLE - HOT GAS PAN",3,"THREE PHASE MOTOR","460/3/60",6,-20,143600,163100,"-",21040,"460/3/60",6,"-","-","-","-","-","1-1/8","3-1/8",1.375,15,20,"-","-",682,1030,"N/A","N/A"]
["W6L143JHA","HIGH STATIC","WAREHOUSE","HOT GAS - REVERSE CYCLE - HOT GAS PAN",3,"THREE PHASE MOTOR","575/3/60",6,-20,143600,163100,"-",21040,"575/3/60",9,"-","-","-","-","-","1-1/8","3-1/8",1.375,15,20,"-","-",682,1030,"N/A","N/A"]
["W6L143JTA","STANDARD","WAREHOUSE","HOT GAS - REVERSE CYCLE - HOT GAS PAN",3,"THREE PHASE MOTOR","575/3/60",6,-20,143600,163100,"-",21040,"575/3/60",7.5,"-","-","-","-","-","1-1/8","3-1/8",1.375,15,20,"-","-",682,1030,"N/A","N/A"]
["W6L179EHA","HIGH STATIC","WAREHOUSE","HOT GAS - REVERSE CYCLE - HOT GAS PAN",3,"THREE PHASE MOTOR","208-230/3/60",6,-20,179500,206600,"-",20625,"208-230/3/60",19.2,"-","-","-","-","-","1-1/8","3-1/8",1.375,20.8,25,"-","-",682,1030,"N/A","N/A"]
["W6L179ETA","STANDARD","WAREHOUSE","HOT GAS - REVERSE CYCLE - HOT GAS PAN",3,"THREE PHASE MOTOR","208-230/3/60",6,-20,179500,206600,"-",20625,"208-230/3/60",12.3,"-","-","-","-","-","1-1/8","3-1/8",1.375,15,20,"-","-",682,1030,"N/A","N/A"]
["W6L179GHA","HIGH STATIC","WAREHOUSE","HOT GAS - REVERSE CYCLE - HOT GAS PAN",3,"THREE PHASE MOTOR","460/3/60",6,-20,179500,206600,"-",20625,"460/3/60",9.6,"-","-","-","-","-","1-1/8","3-1/8",1.375,15,20,"-","-",682,1030,"N/A","N/A"]
["W6L179GTA","STANDARD","WAREHOUSE","HOT GAS - REVERSE CYCLE - HOT GAS PAN",3,"THREE PHASE MOTOR","460/3/60",6,-20,179500,206600,"-",20625,"460/3/60",6,"-","-","-","-","-","1-1/8","3-1/8",1.375,15,20,"-","-",682,1030,"N/A","N/A"]
["W6L179JHA","HIGH STATIC","WAREHOUSE","HOT GAS - REVERSE CYCLE - HOT GAS PAN",3,"THREE PHASE MOTOR","575/3/60",6,-20,179500,206600,"-",20625,"575/3/60",9,"-","-","-","-","-","1-1/8","3-1/8",1.375,15,20,"-","-",682,1030,"N/A","N/A"]
["W6L179JTA","STANDARD","WAREHOUSE","HOT GAS - REVERSE CYCLE - HOT GAS PAN",3,"THREE PHASE MOTOR","575/3/60",6,-20,179500,206600,"-",20625,"575/3/60",7.5,"-","-","-","-","-","1-1/8","3-1/8",1.375,15,20,"-","-",682,1030,"N/A","N/A"]
["W6L216EHA","HIGH STATIC","WAREHOUSE","HOT GAS - REVERSE CYCLE - HOT GAS PAN",4,"THREE PHASE MOTOR","208-230/3/60",6,-20,216200,246100,"-",27500,"208-230/3/60",25.6,"-","-","-","-","-","1-1/8","3-1/8",1.375,27.2,30,"-","-",1050,1360,"N/A","N/A"]
["W6L216ETA","STANDARD","WAREHOUSE","HOT GAS - REVERSE CYCLE - HOT GAS PAN",4,"THREE PHASE MOTOR","208-230/3/60",6,-20,216200,246100,"-",27500,"208-230/3/60",16.399999999999999,"-","-","-","-","-","1-1/8","3-1/8",1.375,17.399999999999999,20,"-","-",1050,1360,"N/A","N/A"]
["W6L216GHA","HIGH STATIC","WAREHOUSE","HOT GAS - REVERSE CYCLE - HOT GAS PAN",4,"THREE PHASE MOTOR","460/3/60",6,-20,216200,246100,"-",27500,"460/3/60",12.8,"-","-","-","-","-","1-1/8","3-1/8",1.375,15,20,"-","-",1050,1360,"N/A","N/A"]
["W6L216GTA","STANDARD","WAREHOUSE","HOT GAS - REVERSE CYCLE - HOT GAS PAN",4,"THREE PHASE MOTOR","460/3/60",6,-20,216200,246100,"-",27500,"460/3/60",8,"-","-","-","-","-","1-1/8","3-1/8",1.375,15,20,"-","-",1050,1360,"N/A","N/A"]
["W6L216JHA","HIGH STATIC","WAREHOUSE","HOT GAS - REVERSE CYCLE - HOT GAS PAN",4,"THREE PHASE MOTOR","575/3/60",6,-20,216200,246100,"-",27500,"575/3/60",12,"-","-","-","-","-","1-1/8","3-1/8",1.375,15,20,"-","-",1050,1360,"N/A","N/A"]
["W6L216JTA","STANDARD","WAREHOUSE","HOT GAS - REVERSE CYCLE - HOT GAS PAN",4,"THREE PHASE MOTOR","575/3/60",6,-20,216200,246100,"-",27500,"575/3/60",10,"-","-","-","-","-","1-1/8","3-1/8",1.375,15,20,"-","-",1050,1360,"N/A","N/A"]
["W6T036EHA","HIGH STATIC","WAREHOUSE","THERMOBANK",1,"THREE PHASE MOTOR","208-230/3/60",6,-20,36400,41900,"-",7080,"208-230/3/60",6.4,"-","-","-","-","-","1/2","2-1/8",1.125,15,20,"-","-",303,480,"N/A","N/A"]
["W6T036EHA","HIGH STATIC","WAREHOUSE","THERMOBANK",1,"THREE PHASE MOTOR","208-230/3/60",6,-20,36400,41900,"-",7080,"208-230/3/60",6.4,"-","-","-","-","-","1/2","2-1/8",1.125,15,20,"-","-",303,480,"N/A","N/A"]
["W6T036ETA","STANDARD","WAREHOUSE","THERMOBANK",1,"THREE PHASE MOTOR","208-230/3/60",6,-20,36400,41900,"-",7080,"208-230/3/60",4.0999999999999996,"-","-","-","-","-","1/2","2-1/8",1.125,15,20,"-","-",303,480,"N/A","N/A"]
["W6T036ETA","STANDARD","WAREHOUSE","THERMOBANK",1,"THREE PHASE MOTOR","208-230/3/60",6,-20,36400,41900,"-",7080,"208-230/3/60",4.0999999999999996,"-","-","-","-","-","1/2","2-1/8",1.125,15,20,"-","-",303,480,"N/A","N/A"]
["W6T036GHA","HIGH STATIC","WAREHOUSE","THERMOBANK",1,"THREE PHASE MOTOR","460/3/60",6,-20,36400,41900,"-",7080,"460/3/60",3.2,"-","-","-","-","-","1/2","2-1/8",1.125,15,20,"-","-",303,480,"N/A","N/A"]
["W6T036GHA","HIGH STATIC","WAREHOUSE","THERMOBANK",1,"THREE PHASE MOTOR","460/3/60",6,-20,36400,41900,"-",7080,"460/3/60",3.2,"-","-","-","-","-","1/2","2-1/8",1.125,15,20,"-","-",303,480,"N/A","N/A"]
["W6T036GTA","STANDARD","WAREHOUSE","THERMOBANK",1,"THREE PHASE MOTOR","460/3/60",6,-20,36400,41900,"-",7080,"460/3/60",2,"-","-","-","-","-","1/2","2-1/8",1.125,15,20,"-","-",303,480,"N/A","N/A"]
["W6T036GTA","STANDARD","WAREHOUSE","THERMOBANK",1,"THREE PHASE MOTOR","460/3/60",6,-20,36400,41900,"-",7080,"460/3/60",2,"-","-","-","-","-","1/2","2-1/8",1.125,15,20,"-","-",303,480,"N/A","N/A"]
["W6T036JHA","HIGH STATIC","WAREHOUSE","THERMOBANK",1,"THREE PHASE MOTOR","575/3/60",6,-20,36400,41900,"-",7080,"575/3/60",3,"-","-","-","-","-","1/2","2-1/8",1.125,15,20,"-","-",303,480,"N/A","N/A"]
["W6T036JHA","HIGH STATIC","WAREHOUSE","THERMOBANK",1,"THREE PHASE MOTOR","575/3/60",6,-20,36400,41900,"-",7080,"575/3/60",3,"-","-","-","-","-","1/2","2-1/8",1.125,15,20,"-","-",303,480,"N/A","N/A"]
["W6T036JTA","STANDARD","WAREHOUSE","THERMOBANK",1,"THREE PHASE MOTOR","575/3/60",6,-20,36400,41900,"-",7080,"575/3/60",2.5,"-","-","-","-","-","1/2","2-1/8",1.125,15,20,"-","-",303,480,"N/A","N/A"]
["W6T036JTA","STANDARD","WAREHOUSE","THERMOBANK",1,"THREE PHASE MOTOR","575/3/60",6,-20,36400,41900,"-",7080,"575/3/60",2.5,"-","-","-","-","-","1/2","2-1/8",1.125,15,20,"-","-",303,480,"N/A","N/A"]
["W6T047EHA","HIGH STATIC","WAREHOUSE","THERMOBANK",1,"THREE PHASE MOTOR","208-230/3/60",6,-20,47900,54600,"-",7010,"208-230/3/60",6.4,"-","-","-","-","-","5/8","2-1/8",1.125,15,20,"-","-",303,480,"N/A","N/A"]
["W6T047EHA","HIGH STATIC","WAREHOUSE","THERMOBANK",1,"THREE PHASE MOTOR","208-230/3/60",6,-20,47900,54600,"-",7010,"208-230/3/60",6.4,"-","-","-","-","-","5/8","2-1/8",1.125,15,20,"-","-",303,480,"N/A","N/A"]
["W6T047ETA","STANDARD","WAREHOUSE","THERMOBANK",1,"THREE PHASE MOTOR","208-230/3/60",6,-20,47900,54600,"-",7010,"208-230/3/60",4.0999999999999996,"-","-","-","-","-","5/8","2-1/8",1.125,15,20,"-","-",303,480,"N/A","N/A"]
["W6T047ETA","STANDARD","WAREHOUSE","THERMOBANK",1,"THREE PHASE MOTOR","208-230/3/60",6,-20,47900,54600,"-",7010,"208-230/3/60",4.0999999999999996,"-","-","-","-","-","5/8","2-1/8",1.125,15,20,"-","-",303,480,"N/A","N/A"]
["W6T047GHA","HIGH STATIC","WAREHOUSE","THERMOBANK",1,"THREE PHASE MOTOR","460/3/60",6,-20,47900,54600,"-",7010,"460/3/60",3.2,"-","-","-","-","-","5/8","2-1/8",1.125,15,20,"-","-",303,480,"N/A","N/A"]
["W6T047GHA","HIGH STATIC","WAREHOUSE","THERMOBANK",1,"THREE PHASE MOTOR","460/3/60",6,-20,47900,54600,"-",7010,"460/3/60",3.2,"-","-","-","-","-","5/8","2-1/8",1.125,15,20,"-","-",303,480,"N/A","N/A"]
["W6T047GTA","STANDARD","WAREHOUSE","THERMOBANK",1,"THREE PHASE MOTOR","460/3/60",6,-20,47900,54600,"-",7010,"460/3/60",2,"-","-","-","-","-","5/8","2-1/8",1.125,15,20,"-","-",303,480,"N/A","N/A"]
["W6T047GTA","STANDARD","WAREHOUSE","THERMOBANK",1,"THREE PHASE MOTOR","460/3/60",6,-20,47900,54600,"-",7010,"460/3/60",2,"-","-","-","-","-","5/8","2-1/8",1.125,15,20,"-","-",303,480,"N/A","N/A"]
["W6T047JHA","HIGH STATIC","WAREHOUSE","THERMOBANK",1,"THREE PHASE MOTOR","575/3/60",6,-20,47900,54600,"-",7010,"575/3/60",3,"-","-","-","-","-","5/8","2-1/8",1.125,15,20,"-","-",303,480,"N/A","N/A"]
["W6T047JHA","HIGH STATIC","WAREHOUSE","THERMOBANK",1,"THREE PHASE MOTOR","575/3/60",6,-20,47900,54600,"-",7010,"575/3/60",3,"-","-","-","-","-","5/8","2-1/8",1.125,15,20,"-","-",303,480,"N/A","N/A"]
["W6T047JTA","STANDARD","WAREHOUSE","THERMOBANK",1,"THREE PHASE MOTOR","575/3/60",6,-20,47900,54600,"-",7010,"575/3/60",2.5,"-","-","-","-","-","5/8","2-1/8",1.125,15,20,"-","-",303,480,"N/A","N/A"]
["W6T047JTA","STANDARD","WAREHOUSE","THERMOBANK",1,"THREE PHASE MOTOR","575/3/60",6,-20,47900,54600,"-",7010,"575/3/60",2.5,"-","-","-","-","-","5/8","2-1/8",1.125,15,20,"-","-",303,480,"N/A","N/A"]
["W6T059EHA","HIGH STATIC","WAREHOUSE","THERMOBANK",1,"THREE PHASE MOTOR","208-230/3/60",6,-20,59200,67900,"-",6875,"208-230/3/60",6.4,"-","-","-","-","-","5/8","2-1/8",1.125,15,20,"-","-",303,480,"N/A","N/A"]
["W6T059EHA","HIGH STATIC","WAREHOUSE","THERMOBANK",1,"THREE PHASE MOTOR","208-230/3/60",6,-20,59200,67900,"-",6875,"208-230/3/60",6.4,"-","-","-","-","-","5/8","2-1/8",1.125,15,20,"-","-",303,480,"N/A","N/A"]
["W6T059ETA","STANDARD","WAREHOUSE","THERMOBANK",1,"THREE PHASE MOTOR","208-230/3/60",6,-20,59200,67900,"-",6875,"208-230/3/60",4.0999999999999996,"-","-","-","-","-","5/8","2-1/8",1.125,15,20,"-","-",303,480,"N/A","N/A"]
["W6T059ETA","STANDARD","WAREHOUSE","THERMOBANK",1,"THREE PHASE MOTOR","208-230/3/60",6,-20,59200,67900,"-",6875,"208-230/3/60",4.0999999999999996,"-","-","-","-","-","5/8","2-1/8",1.125,15,20,"-","-",303,480,"N/A","N/A"]
["W6T059GHA","HIGH STATIC","WAREHOUSE","THERMOBANK",1,"THREE PHASE MOTOR","460/3/60",6,-20,59200,67900,"-",6875,"460/3/60",3.2,"-","-","-","-","-","5/8","2-1/8",1.125,15,20,"-","-",303,480,"N/A","N/A"]
["W6T059GHA","HIGH STATIC","WAREHOUSE","THERMOBANK",1,"THREE PHASE MOTOR","460/3/60",6,-20,59200,67900,"-",6875,"460/3/60",3.2,"-","-","-","-","-","5/8","2-1/8",1.125,15,20,"-","-",303,480,"N/A","N/A"]
["W6T059GTA","STANDARD","WAREHOUSE","THERMOBANK",1,"THREE PHASE MOTOR","460/3/60",6,-20,59200,67900,"-",6875,"460/3/60",2,"-","-","-","-","-","5/8","2-1/8",1.125,15,20,"-","-",303,480,"N/A","N/A"]
["W6T059GTA","STANDARD","WAREHOUSE","THERMOBANK",1,"THREE PHASE MOTOR","460/3/60",6,-20,59200,67900,"-",6875,"460/3/60",2,"-","-","-","-","-","5/8","2-1/8",1.125,15,20,"-","-",303,480,"N/A","N/A"]
["W6T059JHA","HIGH STATIC","WAREHOUSE","THERMOBANK",1,"THREE PHASE MOTOR","575/3/60",6,-20,59200,67900,"-",6875,"575/3/60",3,"-","-","-","-","-","5/8","2-1/8",1.125,15,20,"-","-",303,480,"N/A","N/A"]
["W6T059JHA","HIGH STATIC","WAREHOUSE","THERMOBANK",1,"THREE PHASE MOTOR","575/3/60",6,-20,59200,67900,"-",6875,"575/3/60",3,"-","-","-","-","-","5/8","2-1/8",1.125,15,20,"-","-",303,480,"N/A","N/A"]
["W6T059JTA","STANDARD","WAREHOUSE","THERMOBANK",1,"THREE PHASE MOTOR","575/3/60",6,-20,59200,67900,"-",6875,"575/3/60",2.5,"-","-","-","-","-","5/8","2-1/8",1.125,15,20,"-","-",303,480,"N/A","N/A"]
["W6T059JTA","STANDARD","WAREHOUSE","THERMOBANK",1,"THREE PHASE MOTOR","575/3/60",6,-20,59200,67900,"-",6875,"575/3/60",2.5,"-","-","-","-","-","5/8","2-1/8",1.125,15,20,"-","-",303,480,"N/A","N/A"]
["W6T072EHA","HIGH STATIC","WAREHOUSE","THERMOBANK",2,"THREE PHASE MOTOR","208-230/3/60",6,-20,72500,83500,"-",14160,"208-230/3/60",12.8,"-","-","-","-","-","5/8","2-1/8",1.125,15,20,"-","-",509,750,"N/A","N/A"]
["W6T072EHA","HIGH STATIC","WAREHOUSE","THERMOBANK",2,"THREE PHASE MOTOR","208-230/3/60",6,-20,72500,83500,"-",14160,"208-230/3/60",12.8,"-","-","-","-","-","5/8","2-1/8",1.125,15,20,"-","-",509,750,"N/A","N/A"]
["W6T072ETA","STANDARD","WAREHOUSE","THERMOBANK",2,"THREE PHASE MOTOR","208-230/3/60",6,-20,72500,83500,"-",14160,"208-230/3/60",8.1999999999999993,"-","-","-","-","-","5/8","2-1/8",1.125,15,20,"-","-",509,750,"N/A","N/A"]
["W6T072ETA","STANDARD","WAREHOUSE","THERMOBANK",2,"THREE PHASE MOTOR","208-230/3/60",6,-20,72500,83500,"-",14160,"208-230/3/60",8.1999999999999993,"-","-","-","-","-","5/8","2-1/8",1.125,15,20,"-","-",509,750,"N/A","N/A"]
["W6T072GHA","HIGH STATIC","WAREHOUSE","THERMOBANK",2,"THREE PHASE MOTOR","460/3/60",6,-20,72500,83500,"-",14160,"460/3/60",6.4,"-","-","-","-","-","5/8","2-1/8",1.125,15,20,"-","-",509,750,"N/A","N/A"]
["W6T072GHA","HIGH STATIC","WAREHOUSE","THERMOBANK",2,"THREE PHASE MOTOR","460/3/60",6,-20,72500,83500,"-",14160,"460/3/60",6.4,"-","-","-","-","-","5/8","2-1/8",1.125,15,20,"-","-",509,750,"N/A","N/A"]
["W6T072GTA","STANDARD","WAREHOUSE","THERMOBANK",2,"THREE PHASE MOTOR","460/3/60",6,-20,72500,83500,"-",14160,"460/3/60",4,"-","-","-","-","-","5/8","2-1/8",1.125,15,20,"-","-",509,750,"N/A","N/A"]
["W6T072GTA","STANDARD","WAREHOUSE","THERMOBANK",2,"THREE PHASE MOTOR","460/3/60",6,-20,72500,83500,"-",14160,"460/3/60",4,"-","-","-","-","-","5/8","2-1/8",1.125,15,20,"-","-",509,750,"N/A","N/A"]
["W6T072JHA","HIGH STATIC","WAREHOUSE","THERMOBANK",2,"THREE PHASE MOTOR","575/3/60",6,-20,72500,83500,"-",14160,"575/3/60",6,"-","-","-","-","-","5/8","2-1/8",1.125,15,20,"-","-",509,750,"N/A","N/A"]
["W6T072JHA","HIGH STATIC","WAREHOUSE","THERMOBANK",2,"THREE PHASE MOTOR","575/3/60",6,-20,72500,83500,"-",14160,"575/3/60",6,"-","-","-","-","-","5/8","2-1/8",1.125,15,20,"-","-",509,750,"N/A","N/A"]
["W6T072JTA","STANDARD","WAREHOUSE","THERMOBANK",2,"THREE PHASE MOTOR","575/3/60",6,-20,72500,83500,"-",14160,"575/3/60",5,"-","-","-","-","-","5/8","2-1/8",1.125,15,20,"-","-",509,750,"N/A","N/A"]
["W6T072JTA","STANDARD","WAREHOUSE","THERMOBANK",2,"THREE PHASE MOTOR","575/3/60",6,-20,72500,83500,"-",14160,"575/3/60",5,"-","-","-","-","-","5/8","2-1/8",1.125,15,20,"-","-",509,750,"N/A","N/A"]
["W6T096EHA","HIGH STATIC","WAREHOUSE","THERMOBANK",2,"THREE PHASE MOTOR","208-230/3/60",6,-20,96100,109400,"-",14030,"208-230/3/60",12.8,"-","-","-","-","-","7/8","3-1/8",1.125,15,20,"-","-",509,750,"N/A","N/A"]
["W6T096EHA","HIGH STATIC","WAREHOUSE","THERMOBANK",2,"THREE PHASE MOTOR","208-230/3/60",6,-20,96100,109400,"-",14030,"208-230/3/60",12.8,"-","-","-","-","-","7/8","3-1/8",1.125,15,20,"-","-",509,750,"N/A","N/A"]
["W6T096ETA","STANDARD","WAREHOUSE","THERMOBANK",2,"THREE PHASE MOTOR","208-230/3/60",6,-20,96100,109400,"-",14030,"208-230/3/60",8.1999999999999993,"-","-","-","-","-","7/8","3-1/8",1.125,15,20,"-","-",509,750,"N/A","N/A"]
["W6T096ETA","STANDARD","WAREHOUSE","THERMOBANK",2,"THREE PHASE MOTOR","208-230/3/60",6,-20,96100,109400,"-",14030,"208-230/3/60",8.1999999999999993,"-","-","-","-","-","7/8","3-1/8",1.125,15,20,"-","-",509,750,"N/A","N/A"]
["W6T096GHA","HIGH STATIC","WAREHOUSE","THERMOBANK",2,"THREE PHASE MOTOR","460/3/60",6,-20,96100,109400,"-",14030,"460/3/60",6.4,"-","-","-","-","-","7/8","3-1/8",1.125,15,20,"-","-",509,750,"N/A","N/A"]
["W6T096GHA","HIGH STATIC","WAREHOUSE","THERMOBANK",2,"THREE PHASE MOTOR","460/3/60",6,-20,96100,109400,"-",14030,"460/3/60",6.4,"-","-","-","-","-","7/8","3-1/8",1.125,15,20,"-","-",509,750,"N/A","N/A"]
["W6T096GTA","STANDARD","WAREHOUSE","THERMOBANK",2,"THREE PHASE MOTOR","460/3/60",6,-20,96100,109400,"-",14030,"460/3/60",4,"-","-","-","-","-","7/8","3-1/8",1.125,15,20,"-","-",509,750,"N/A","N/A"]
["W6T096GTA","STANDARD","WAREHOUSE","THERMOBANK",2,"THREE PHASE MOTOR","460/3/60",6,-20,96100,109400,"-",14030,"460/3/60",4,"-","-","-","-","-","7/8","3-1/8",1.125,15,20,"-","-",509,750,"N/A","N/A"]
["W6T096JHA","HIGH STATIC","WAREHOUSE","THERMOBANK",2,"THREE PHASE MOTOR","575/3/60",6,-20,96100,109400,"-",14030,"575/3/60",6,"-","-","-","-","-","7/8","3-1/8",1.125,15,20,"-","-",509,750,"N/A","N/A"]
["W6T096JHA","HIGH STATIC","WAREHOUSE","THERMOBANK",2,"THREE PHASE MOTOR","575/3/60",6,-20,96100,109400,"-",14030,"575/3/60",6,"-","-","-","-","-","7/8","3-1/8",1.125,15,20,"-","-",509,750,"N/A","N/A"]
["W6T096JTA","STANDARD","WAREHOUSE","THERMOBANK",2,"THREE PHASE MOTOR","575/3/60",6,-20,96100,109400,"-",14030,"575/3/60",5,"-","-","-","-","-","7/8","3-1/8",1.125,15,20,"-","-",509,750,"N/A","N/A"]
["W6T096JTA","STANDARD","WAREHOUSE","THERMOBANK",2,"THREE PHASE MOTOR","575/3/60",6,-20,96100,109400,"-",14030,"575/3/60",5,"-","-","-","-","-","7/8","3-1/8",1.125,15,20,"-","-",509,750,"N/A","N/A"]
["W6T120EHA","HIGH STATIC","WAREHOUSE","THERMOBANK",2,"THREE PHASE MOTOR","208-230/3/60",6,-20,120000,137200,"-",13750,"208-230/3/60",12.8,"-","-","-","-","-","7/8","3-1/8",1.125,15,20,"-","-",509,750,"N/A","N/A"]
["W6T120EHA","HIGH STATIC","WAREHOUSE","THERMOBANK",2,"THREE PHASE MOTOR","208-230/3/60",6,-20,120000,137200,"-",13750,"208-230/3/60",12.8,"-","-","-","-","-","7/8","3-1/8",1.125,15,20,"-","-",509,750,"N/A","N/A"]
["W6T120ETA","STANDARD","WAREHOUSE","THERMOBANK",2,"THREE PHASE MOTOR","208-230/3/60",6,-20,120000,137200,"-",13750,"208-230/3/60",8.1999999999999993,"-","-","-","-","-","7/8","3-1/8",1.125,15,20,"-","-",509,750,"N/A","N/A"]
["W6T120ETA","STANDARD","WAREHOUSE","THERMOBANK",2,"THREE PHASE MOTOR","208-230/3/60",6,-20,120000,137200,"-",13750,"208-230/3/60",8.1999999999999993,"-","-","-","-","-","7/8","3-1/8",1.125,15,20,"-","-",509,750,"N/A","N/A"]
["W6T120GHA","HIGH STATIC","WAREHOUSE","THERMOBANK",2,"THREE PHASE MOTOR","460/3/60",6,-20,120000,137200,"-",13750,"460/3/60",6.4,"-","-","-","-","-","7/8","3-1/8",1.125,15,20,"-","-",509,750,"N/A","N/A"]
["W6T120GHA","HIGH STATIC","WAREHOUSE","THERMOBANK",2,"THREE PHASE MOTOR","460/3/60",6,-20,120000,137200,"-",13750,"460/3/60",6.4,"-","-","-","-","-","7/8","3-1/8",1.125,15,20,"-","-",509,750,"N/A","N/A"]
["W6T120GTA","STANDARD","WAREHOUSE","THERMOBANK",2,"THREE PHASE MOTOR","460/3/60",6,-20,120000,137200,"-",13750,"460/3/60",4,"-","-","-","-","-","7/8","3-1/8",1.125,15,20,"-","-",509,750,"N/A","N/A"]
["W6T120GTA","STANDARD","WAREHOUSE","THERMOBANK",2,"THREE PHASE MOTOR","460/3/60",6,-20,120000,137200,"-",13750,"460/3/60",4,"-","-","-","-","-","7/8","3-1/8",1.125,15,20,"-","-",509,750,"N/A","N/A"]
["W6T120JHA","HIGH STATIC","WAREHOUSE","THERMOBANK",2,"THREE PHASE MOTOR","575/3/60",6,-20,120000,137200,"-",13750,"575/3/60",6,"-","-","-","-","-","7/8","3-1/8",1.125,15,20,"-","-",509,750,"N/A","N/A"]
["W6T120JHA","HIGH STATIC","WAREHOUSE","THERMOBANK",2,"THREE PHASE MOTOR","575/3/60",6,-20,120000,137200,"-",13750,"575/3/60",6,"-","-","-","-","-","7/8","3-1/8",1.125,15,20,"-","-",509,750,"N/A","N/A"]
["W6T120JTA","STANDARD","WAREHOUSE","THERMOBANK",2,"THREE PHASE MOTOR","575/3/60",6,-20,120000,137200,"-",13750,"575/3/60",5,"-","-","-","-","-","7/8","3-1/8",1.125,15,20,"-","-",509,750,"N/A","N/A"]
["W6T120JTA","STANDARD","WAREHOUSE","THERMOBANK",2,"THREE PHASE MOTOR","575/3/60",6,-20,120000,137200,"-",13750,"575/3/60",5,"-","-","-","-","-","7/8","3-1/8",1.125,15,20,"-","-",509,750,"N/A","N/A"]
["W6T143EHA","HIGH STATIC","WAREHOUSE","THERMOBANK",3,"THREE PHASE MOTOR","208-230/3/60",6,-20,143600,163100,"-",21040,"208-230/3/60",19.2,"-","-","-","-","-","1-1/8","3-1/8",1.375,20.8,25,"-","-",682,1030,"N/A","N/A"]
["W6T143EHA","HIGH STATIC","WAREHOUSE","THERMOBANK",3,"THREE PHASE MOTOR","208-230/3/60",6,-20,143600,163100,"-",21040,"208-230/3/60",19.2,"-","-","-","-","-","1-1/8","3-1/8",1.375,20.8,25,"-","-",682,1030,"N/A","N/A"]
["W6T143ETA","STANDARD","WAREHOUSE","THERMOBANK",3,"THREE PHASE MOTOR","208-230/3/60",6,-20,143600,163100,"-",21040,"208-230/3/60",12.3,"-","-","-","-","-","1-1/8","3-1/8",1.375,15,20,"-","-",682,1030,"N/A","N/A"]
["W6T143ETA","STANDARD","WAREHOUSE","THERMOBANK",3,"THREE PHASE MOTOR","208-230/3/60",6,-20,143600,163100,"-",21040,"208-230/3/60",12.3,"-","-","-","-","-","1-1/8","3-1/8",1.375,15,20,"-","-",682,1030,"N/A","N/A"]
["W6T143GHA","HIGH STATIC","WAREHOUSE","THERMOBANK",3,"THREE PHASE MOTOR","460/3/60",6,-20,143600,163100,"-",21040,"460/3/60",9.6,"-","-","-","-","-","1-1/8","3-1/8",1.375,15,20,"-","-",682,1030,"N/A","N/A"]
["W6T143GHA","HIGH STATIC","WAREHOUSE","THERMOBANK",3,"THREE PHASE MOTOR","460/3/60",6,-20,143600,163100,"-",21040,"460/3/60",9.6,"-","-","-","-","-","1-1/8","3-1/8",1.375,15,20,"-","-",682,1030,"N/A","N/A"]
["W6T143GTA","STANDARD","WAREHOUSE","THERMOBANK",3,"THREE PHASE MOTOR","460/3/60",6,-20,143600,163100,"-",21040,"460/3/60",6,"-","-","-","-","-","1-1/8","3-1/8",1.375,15,20,"-","-",682,1030,"N/A","N/A"]
["W6T143GTA","STANDARD","WAREHOUSE","THERMOBANK",3,"THREE PHASE MOTOR","460/3/60",6,-20,143600,163100,"-",21040,"460/3/60",6,"-","-","-","-","-","1-1/8","3-1/8",1.375,15,20,"-","-",682,1030,"N/A","N/A"]
["W6T143JHA","HIGH STATIC","WAREHOUSE","THERMOBANK",3,"THREE PHASE MOTOR","575/3/60",6,-20,143600,163100,"-",21040,"575/3/60",9,"-","-","-","-","-","1-1/8","3-1/8",1.375,15,20,"-","-",682,1030,"N/A","N/A"]
["W6T143JHA","HIGH STATIC","WAREHOUSE","THERMOBANK",3,"THREE PHASE MOTOR","575/3/60",6,-20,143600,163100,"-",21040,"575/3/60",9,"-","-","-","-","-","1-1/8","3-1/8",1.375,15,20,"-","-",682,1030,"N/A","N/A"]
["W6T143JTA","STANDARD","WAREHOUSE","THERMOBANK",3,"THREE PHASE MOTOR","575/3/60",6,-20,143600,163100,"-",21040,"575/3/60",7.5,"-","-","-","-","-","1-1/8","3-1/8",1.375,15,20,"-","-",682,1030,"N/A","N/A"]
["W6T143JTA","STANDARD","WAREHOUSE","THERMOBANK",3,"THREE PHASE MOTOR","575/3/60",6,-20,143600,163100,"-",21040,"575/3/60",7.5,"-","-","-","-","-","1-1/8","3-1/8",1.375,15,20,"-","-",682,1030,"N/A","N/A"]
["W6T179EHA","HIGH STATIC","WAREHOUSE","THERMOBANK",3,"THREE PHASE MOTOR","208-230/3/60",6,-20,179500,206600,"-",20625,"208-230/3/60",19.2,"-","-","-","-","-","1-1/8","3-1/8",1.375,20.8,25,"-","-",682,1030,"N/A","N/A"]
["W6T179EHA","HIGH STATIC","WAREHOUSE","THERMOBANK",3,"THREE PHASE MOTOR","208-230/3/60",6,-20,179500,206600,"-",20625,"208-230/3/60",19.2,"-","-","-","-","-","1-1/8","3-1/8",1.375,20.8,25,"-","-",682,1030,"N/A","N/A"]
["W6T179ETA","STANDARD","WAREHOUSE","THERMOBANK",3,"THREE PHASE MOTOR","208-230/3/60",6,-20,179500,206600,"-",20625,"208-230/3/60",12.3,"-","-","-","-","-","1-1/8","3-1/8",1.375,15,20,"-","-",682,1030,"N/A","N/A"]
["W6T179ETA","STANDARD","WAREHOUSE","THERMOBANK",3,"THREE PHASE MOTOR","208-230/3/60",6,-20,179500,206600,"-",20625,"208-230/3/60",12.3,"-","-","-","-","-","1-1/8","3-1/8",1.375,15,20,"-","-",682,1030,"N/A","N/A"]
["W6T179GHA","HIGH STATIC","WAREHOUSE","THERMOBANK",3,"THREE PHASE MOTOR","460/3/60",6,-20,179500,206600,"-",20625,"460/3/60",9.6,"-","-","-","-","-","1-1/8","3-1/8",1.375,15,20,"-","-",682,1030,"N/A","N/A"]
["W6T179GHA","HIGH STATIC","WAREHOUSE","THERMOBANK",3,"THREE PHASE MOTOR","460/3/60",6,-20,179500,206600,"-",20625,"460/3/60",9.6,"-","-","-","-","-","1-1/8","3-1/8",1.375,15,20,"-","-",682,1030,"N/A","N/A"]
["W6T179GTA","STANDARD","WAREHOUSE","THERMOBANK",3,"THREE PHASE MOTOR","460/3/60",6,-20,179500,206600,"-",20625,"460/3/60",6,"-","-","-","-","-","1-1/8","3-1/8",1.375,15,20,"-","-",682,1030,"N/A","N/A"]
["W6T179GTA","STANDARD","WAREHOUSE","THERMOBANK",3,"THREE PHASE MOTOR","460/3/60",6,-20,179500,206600,"-",20625,"460/3/60",6,"-","-","-","-","-","1-1/8","3-1/8",1.375,15,20,"-","-",682,1030,"N/A","N/A"]
["W6T179JHA","HIGH STATIC","WAREHOUSE","THERMOBANK",3,"THREE PHASE MOTOR","575/3/60",6,-20,179500,206600,"-",20625,"575/3/60",9,"-","-","-","-","-","1-1/8","3-1/8",1.375,15,20,"-","-",682,1030,"N/A","N/A"]
["W6T179JHA","HIGH STATIC","WAREHOUSE","THERMOBANK",3,"THREE PHASE MOTOR","575/3/60",6,-20,179500,206600,"-",20625,"575/3/60",9,"-","-","-","-","-","1-1/8","3-1/8",1.375,15,20,"-","-",682,1030,"N/A","N/A"]
["W6T179JTA","STANDARD","WAREHOUSE","THERMOBANK",3,"THREE PHASE MOTOR","575/3/60",6,-20,179500,206600,"-",20625,"575/3/60",7.5,"-","-","-","-","-","1-1/8","3-1/8",1.375,15,20,"-","-",682,1030,"N/A","N/A"]
["W6T179JTA","STANDARD","WAREHOUSE","THERMOBANK",3,"THREE PHASE MOTOR","575/3/60",6,-20,179500,206600,"-",20625,"575/3/60",7.5,"-","-","-","-","-","1-1/8","3-1/8",1.375,15,20,"-","-",682,1030,"N/A","N/A"]
["W6T216EHA","HIGH STATIC","WAREHOUSE","THERMOBANK",4,"THREE PHASE MOTOR","208-230/3/60",6,-20,216200,246100,"-",27500,"208-230/3/60",25.6,"-","-","-","-","-","1-1/8","3-1/8",1.375,27.2,30,"-","-",1050,1360,"N/A","N/A"]
["W6T216EHA","HIGH STATIC","WAREHOUSE","THERMOBANK",4,"THREE PHASE MOTOR","208-230/3/60",6,-20,216200,246100,"-",27500,"208-230/3/60",25.6,"-","-","-","-","-","1-1/8","3-1/8",1.375,27.2,30,"-","-",1050,1360,"N/A","N/A"]
["W6T216ETA","STANDARD","WAREHOUSE","THERMOBANK",4,"THREE PHASE MOTOR","208-230/3/60",6,-20,216200,246100,"-",27500,"208-230/3/60",16.399999999999999,"-","-","-","-","-","1-1/8","3-1/8",1.375,17.399999999999999,20,"-","-",1050,1360,"N/A","N/A"]
["W6T216ETA","STANDARD","WAREHOUSE","THERMOBANK",4,"THREE PHASE MOTOR","208-230/3/60",6,-20,216200,246100,"-",27500,"208-230/3/60",16.399999999999999,"-","-","-","-","-","1-1/8","3-1/8",1.375,17.399999999999999,20,"-","-",1050,1360,"N/A","N/A"]
["W6T216GHA","HIGH STATIC","WAREHOUSE","THERMOBANK",4,"THREE PHASE MOTOR","460/3/60",6,-20,216200,246100,"-",27500,"460/3/60",12.8,"-","-","-","-","-","1-1/8","3-1/8",1.375,15,20,"-","-",1050,1360,"N/A","N/A"]
["W6T216GHA","HIGH STATIC","WAREHOUSE","THERMOBANK",4,"THREE PHASE MOTOR","460/3/60",6,-20,216200,246100,"-",27500,"460/3/60",12.8,"-","-","-","-","-","1-1/8","3-1/8",1.375,15,20,"-","-",1050,1360,"N/A","N/A"]
["W6T216GTA","STANDARD","WAREHOUSE","THERMOBANK",4,"THREE PHASE MOTOR","460/3/60",6,-20,216200,246100,"-",27500,"460/3/60",8,"-","-","-","-","-","1-1/8","3-1/8",1.375,15,20,"-","-",1050,1360,"N/A","N/A"]
["W6T216GTA","STANDARD","WAREHOUSE","THERMOBANK",4,"THREE PHASE MOTOR","460/3/60",6,-20,216200,246100,"-",27500,"460/3/60",8,"-","-","-","-","-","1-1/8","3-1/8",1.375,15,20,"-","-",1050,1360,"N/A","N/A"]
["W6T216JHA","HIGH STATIC","WAREHOUSE","THERMOBANK",4,"THREE PHASE MOTOR","575/3/60",6,-20,216200,246100,"-",27500,"575/3/60",12,"-","-","-","-","-","1-1/8","3-1/8",1.375,15,20,"-","-",1050,1360,"N/A","N/A"]
["W6T216JHA","HIGH STATIC","WAREHOUSE","THERMOBANK",4,"THREE PHASE MOTOR","575/3/60",6,-20,216200,246100,"-",27500,"575/3/60",12,"-","-","-","-","-","1-1/8","3-1/8",1.375,15,20,"-","-",1050,1360,"N/A","N/A"]
["W6T216JTA","STANDARD","WAREHOUSE","THERMOBANK",4,"THREE PHASE MOTOR","575/3/60",6,-20,216200,246100,"-",27500,"575/3/60",10,"-","-","-","-","-","1-1/8","3-1/8",1.375,15,20,"-","-",1050,1360,"N/A","N/A"]
["W6T216JTA","STANDARD","WAREHOUSE","THERMOBANK",4,"THREE PHASE MOTOR","575/3/60",6,-20,216200,246100,"-",27500,"575/3/60",10,"-","-","-","-","-","1-1/8","3-1/8",1.375,15,20,"-","-",1050,1360,"N/A","N/A"]
["W4D029ETA","STANDARD ","WAREHOUSE","ELECTRIC DEFROST -MEDIUM TEMP",1,"THREE-PHASE MOTOR","208-230/3/60",4,25,30500,35800,null,7080,"208-230/3/60",4.0999999999999996,"208-230/3/60",1,{"$f":"S754/Q754","v":14.4},14.4,6000,"1/2","1-1/8","-",15,20,16.399999999999999,20,303,480,"N/A","N/A"]
["W4D041ETA","STANDARD ","WAREHOUSE","ELECTRIC DEFROST -MEDIUM TEMP",1,"THREE-PHASE MOTOR","208-230/3/60",4,25,41600,48700,null,7010,"208-230/3/60",4.0999999999999996,"208-230/3/60",1,14.4,14.4,6000,"1/2","1-3/8","-",15,20,16.399999999999999,20,303,480,"N/A","N/A"]
["W4D050ETA","STANDARD ","WAREHOUSE","ELECTRIC DEFROST -MEDIUM TEMP",1,"THREE-PHASE MOTOR","208-230/3/60",4,25,51500,61000,null,6875,"208-230/3/60",4.0999999999999996,"208-230/3/60",1,14.4,14.4,6000,"5/8","1-5/8","-",15,20,16.399999999999999,20,303,480,"N/A","N/A"]
["W4D060ETA","STANDARD ","WAREHOUSE","ELECTRIC DEFROST -MEDIUM TEMP",2,"THREE-PHASE MOTOR","208-230/3/60",4,25,61600,71600,null,14160,"208-230/3/60",8.1999999999999993,"208-230/3/60",1,28.9,28.9,12000,"5/8","1-5/8","-",15,20,30.9,35,509,750,"N/A","N/A"]
["W4D082ETA","STANDARD ","WAREHOUSE","ELECTRIC DEFROST -MEDIUM TEMP",2,"THREE-PHASE MOTOR","208-230/3/60",4,25,83600,98700,null,14030,"208-230/3/60",8.1999999999999993,"208-230/3/60",1,28.9,28.9,12000,"7/8","2-1/8","-",15,20,30.9,35,509,750,"N/A","N/A"]
["W4D103ETA","STANDARD ","WAREHOUSE","ELECTRIC DEFROST -MEDIUM TEMP",2,"THREE-PHASE MOTOR","208-230/3/60",4,25,103700,122800,null,13750,"208-230/3/60",8.1999999999999993,"208-230/3/60",1,28.9,28.9,12000,"7/8","2-1/8","-",15,20,30.9,35,509,750,"N/A","N/A"]
["W4D126ETA","STANDARD ","WAREHOUSE","ELECTRIC DEFROST -MEDIUM TEMP",3,"THREE-PHASE MOTOR","208-230/3/60",4,25,126600,148800,null,21040,"208-230/3/60",12.3,"208-230/3/60",1,43.3,43.3,18000,"7/8","2-1/8","-",15,20,45.3,50,682,1030,"N/A","N/A"]
["W4D155ETA","STANDARD ","WAREHOUSE","ELECTRIC DEFROST -MEDIUM TEMP",3,"THREE-PHASE MOTOR","208-230/3/60",4,25,155800,183600,null,20625,"208-230/3/60",12.3,"208-230/3/60",1,43.3,43.3,18000,"1-1/8","2-1/8","-",15,20,45.3,50,682,1030,"N/A","N/A"]
["W4D167ETA","STANDARD ","WAREHOUSE","ELECTRIC DEFROST -MEDIUM TEMP",4,"THREE-PHASE MOTOR","208-230/3/60",4,25,168200,200100,null,27500,"208-230/3/60",16.399999999999999,"208-230/3/60",2,28.85,57.7,24000,"1-1/8","2-1/8","-",17.399999999999999,20,59.7,60,1050,1360,"N/A","N/A"]
["W4D206ETA","STANDARD ","WAREHOUSE","ELECTRIC DEFROST -MEDIUM TEMP",4,"THREE-PHASE MOTOR","208-230/3/60",4,25,207900,250000,null,27500,"208-230/3/60",16.399999999999999,"208-230/3/60",2,28.85,57.7,24000,"1-1/8","2-1/8","-",17.399999999999999,20,59.7,60,1050,1360,"N/A","N/A"]
["W4D029GTA","STANDARD ","WAREHOUSE","ELECTRIC DEFROST -MEDIUM TEMP",1,"THREE-PHASE MOTOR","460/3/60",4,25,30500,35800,null,7080,"460/3/60",2,"460/3/60",1,7.5,7.5,6000,"1/2","1-1/8","-",15,20,15,20,303,480,"N/A","N/A"]
["W4D041GTA","STANDARD ","WAREHOUSE","ELECTRIC DEFROST -MEDIUM TEMP",1,"THREE-PHASE MOTOR","460/3/60",4,25,41600,48700,null,7010,"460/3/60",2,"460/3/60",1,7.5,7.5,6000,"1/2","1-3/8","-",15,20,15,20,303,480,"N/A","N/A"]
["W4D050GTA","STANDARD ","WAREHOUSE","ELECTRIC DEFROST -MEDIUM TEMP",1,"THREE-PHASE MOTOR","460/3/60",4,25,51500,61000,null,6875,"460/3/60",2,"460/3/60",1,7.5,7.5,6000,"5/8","1-5/8","-",15,20,15,20,303,480,"N/A","N/A"]
["W4D060GTA","STANDARD ","WAREHOUSE","ELECTRIC DEFROST -MEDIUM TEMP",2,"THREE-PHASE MOTOR","460/3/60",4,25,61600,71600,null,14160,"460/3/60",4,"460/3/60",1,15.1,15.1,12000,"5/8","1-5/8","-",15,20,16.100000000000001,20,509,750,"N/A","N/A"]
["W4D082GTA","STANDARD ","WAREHOUSE","ELECTRIC DEFROST -MEDIUM TEMP",2,"THREE-PHASE MOTOR","460/3/60",4,25,83600,98700,null,14030,"460/3/60",4,"460/3/60",1,15.1,15.1,12000,"7/8","2-1/8","-",15,20,16.100000000000001,20,509,750,"N/A","N/A"]
["W4D103GTA","STANDARD ","WAREHOUSE","ELECTRIC DEFROST -MEDIUM TEMP",2,"THREE-PHASE MOTOR","460/3/60",4,25,103700,122800,null,13750,"460/3/60",4,"460/3/60",1,15.1,15.1,12000,"7/8","2-1/8","-",15,20,16.100000000000001,20,509,750,"N/A","N/A"]
["W4D126GTA","STANDARD ","WAREHOUSE","ELECTRIC DEFROST -MEDIUM TEMP",3,"THREE-PHASE MOTOR","460/3/60",4,25,126600,148800,null,21040,"460/3/60",6,"460/3/60",1,22.6,22.6,18000,"7/8","2-1/8","-",15,20,23.6,25,682,1030,"N/A","N/A"]
["W4D155GTA","STANDARD ","WAREHOUSE","ELECTRIC DEFROST -MEDIUM TEMP",3,"THREE-PHASE MOTOR","460/3/60",4,25,155800,183600,null,20625,"460/3/60",6,"460/3/60",1,22.6,22.6,18000,"1-1/8","2-1/8","-",15,20,23.6,25,682,1030,"N/A","N/A"]
["W4D167GTA","STANDARD ","WAREHOUSE","ELECTRIC DEFROST -MEDIUM TEMP",4,"THREE-PHASE MOTOR","460/3/60",4,25,168200,200100,null,27500,"460/3/60",8,"460/3/60",1,30.1,30.1,24000,"1-1/8","2-1/8","-",15,20,31.1,35,1050,1360,"N/A","N/A"]
["W4D206GTA","STANDARD ","WAREHOUSE","ELECTRIC DEFROST -MEDIUM TEMP",4,"THREE-PHASE MOTOR","460/3/60",4,25,207900,250000,null,27500,"460/3/60",8,"460/3/60",1,30.1,30.1,24000,"1-1/8","2-1/8","-",15,20,31.1,35,1050,1360,"N/A","N/A"]
[null,null,null,null,null,null,null," "]

{"sheet":"All Temp Options","index":4,"n_rows":28,"n_cols":5,"rows_kept":28,"cut":false,"hidden":true,"merged":[]}
[]
[]
[]
[]
[]
[]
[]
[null,null,"Generic Option Name"]
[null,null,{"$f":"IF(OR(Submital!F14=\"Hot Gas - 3 Pipe - Elec. Drain Pan\",Submital!F14=\"Hot Gas - 3 Pipe - H.G. Drain Pain\",Submital!F14=\"Hot Gas - Reverse Cycle - Elec. Drain Pan\",Submital!F14=\"Hot Gas - Reverse Cycle - H.G. Drain Pain\",Submital!F14=\"Thermobank\"),\"\",\"EcoNet\")","v":"EcoNet"}]
[null,null,{"$f":"IF(OR(Submital!F14=\"Hot Gas - 3 Pipe - Elec. Drain Pan\",Submital!F14=\"Hot Gas - 3 Pipe - H.G. Drain Pain\",Submital!F14=\"Hot Gas - Reverse Cycle - Elec. Drain Pan\",Submital!F14=\"Hot Gas - Reverse Cycle - H.G. Drain Pain\",Submital!F14=\"Thermobank\"),\"\",\"EcoNet Command Center - Loose\")","v":"EcoNet Command Center - Loose"}]
[null,null,"Mechanical Thermostat - Mounted",null,"Hot Gas - 3 Pipe - Elec. Drain Pan"]
[null,null,"Electronic Room Thermostat - Mounted",null,"Hot Gas - 3 Pipe - H.G. Drain Pain"]
[null,null,"Thermostatic Expanion Valve - Mounted",null,"Hot Gas - Reverse Cycle - Elec. Drain Pan"]
[null,null,"Electronic Expansion Valve - Mounted",null,"Hot Gas - Reverse Cycle - H.G. Drain Pain"]
[null,null,"Liquid Line Solenoid Valve - Mounted"]
[null,null,"Mechanical Thermostat - Loose"]
[null,null,"Electronic Room Thermostat - Loose"]
[null,null,"Thermostatic Expansion Valve - Loose"]
[null,null,"Electronic Expanison Valve - Loose"]
[null,null,"Liquid Line Solenoid Valve - Loose"]
[null,null,{"$f":"IF(AND(OR(Submital!F14=\"Electric\",Submital!F14=\"Hot Gas - 3 Pipe - Elec. Drain Pan\",Submital!F14=\"Hot Gas - 3 Pipe - H.G. Drain Pain\",Submital!F14=\"Hot Gas - Reverse Cycle - Elec. Drain Pan\",Submital!F14=\"Hot Gas - Reverse Cycle - H.G. Drain Pain\",Submital!F14=\"Thermobank\"),OR(Submital!I14=\"15\",Submital!I14=\"10\",Submital!I14=\"0\",Submital!I14=\"-10\",Submital!I14=\"-20\",Submital!I14=\"-30\",Submital!I14=\"-40\")),\"High-Static Fan Blades\",\"\")","v":""}]
[null,null,"Heat Exchanger HX-25 - Loose"]
[null,null,"Heat Exchanger HX-50 - Loose"]
[null,null,"Heat Exchanger HX-75 - Loose"]
[null,null,"Heat Exchanger HX-100 - Loose"]
[null,null,"Heat Exchanger HX-150 - Loose"]
[null,null,"Heat Exchanger HX-250 - Loose"]
[null,null,"Heat Exchanger HX-350 - Loose"]

{"sheet":"Pics","index":5,"n_rows":22,"n_cols":5,"rows_kept":22,"cut":false,"hidden":true,"merged":[]}
[]
[]
[]
[null,null,1]
[null,null,2]
[null,null,3]
[null,null,4]
[]
[]
[]
[]
[]
[]
[]
[]
[]
[]
[]
[null,null,null,null,"Russell"]
[null,null,null,null,"Witt"]
[null,null,null,null,"Kramer"]
[null,null,null,null,"ColdZone"]