{"text_format":"1","workbook":"xlsx","n_sheets":5,"sheets":["Submital","REVISION","SUBMITTAL DATA","All Temp Options","Pics"],"not_rendered":{"charts":0,"images":15,"macros":1,"external_links":0,"defined_names":20,"comments":0,"pivot_tables":0},"unopened":[],"bounds":{"document_bytes":16777216,"sheet_cells":100000,"rows_first":2000,"rows_last":500,"rows_between":2000,"halvings":0,"cell_chars":16384,"cell_head_chars":4096},"cells_cut":0,"cells_raw":0,"read":"whole","date_system":"1900"}

{"sheet":"Submital","index":0,"n_rows":69,"n_cols":33,"rows_kept":69,"cut":false,"hidden":false,"merged":[[5,11,5,13],[5,0,5,7],[6,0,6,4],[7,0,7,4],[8,0,8,4],[6,11,6,13],[7,11,7,13],[8,11,8,13],[6,5,6,7],[7,5,7,7],[6,8,6,10],[7,8,7,10],[8,8,8,10],[8,5,8,7],[14,0,14,13],[9,0,9,4],[10,0,10,4],[12,2,12,3],[13,2,13,3],[11,0,11,13],[12,0,12,1],[12,12,12,13],[13,0,13,1],[10,11,10,13],[10,8,10,10],[9,8,9,10],[10,5,10,7],[13,12,13,13],[12,5,12,7],[13,5,13,7],[9,11,9,13],[9,5,9,7],[12,10,12,11],[13,10,13,11],[4,6,4,10],[4,12,4,13],[0,0,4,5],[0,6,0,10],[0,11,0,13],[1,6,1,10],[1,11,1,13],[2,6,2,10],[2,11,2,13],[3,6,3,10],[3,12,3,13],[5,8,5,10],[15,0,29,13],[31,0,32,1],[33,0,33,1],[31,7,32,7],[31,6,32,6],[31,2,32,2],[31,8,32,8],[31,3,31,5],[31,9,32,9],[31,10,32,10],[31,11,32,11],[30,13,32,13],[30,2,30,11],[50,0,50,1],[39,0,39,13],[37,0,37,1],[35,0,36,1],[35,9,36,9],[35,10,36,10],[43,0,43,13],[40,8,40,13],[41,8,41,13],[42,8,42,13],[40,6,42,7],[40,0,40,5],[41,0,41,5],[42,0,42,5],[35,11,36,11],[38,0,38,13],[48,0,48,8],[49,0,49,1],[35,2,36,3],[37,2,37,3],[35,8,36,8],[44,0,44,13],[45,0,47,13],[34,0,34,11],[35,4,36,4],[35,5,36,5],[35,6,36,7],[37,6,37,7]]}
[null,null,null,null,null,null,"HEAT TRANSFER PRODUCTS GROUP, LLC",null,null,null,null,"SUBMITTAL DATA SHEET"]
[null,null,null,null,null,null,"3885 Crestwood Parkway / Suite 500",null,null,null,null,"HEAVY DUTY",null,null,null,null,null,null,null,null,null,null,null,null,"shows 744 in list","No"]
[null,null,null,null,null,null,"Duluth, GA  30096",null,null,null,null,"UNIT COOLER"]
[null,null,null,null,null,null,"(P) 800-288-9488 / (F) 256-259-7478",null,null,null,null,null,"For Record Only",null,null,null,null,null,null,null,null,null,{"$f":"IF(OR(E14=\"\",E14=6),\"Air\",\"\")","v":"Air"}]
[null,null,null,null,null,null,"https://www.htpg.com/",null,null,null,null,null,"For Approval",null,null,null,null,null,null,null,null,null,"Electric"]
[{"$f":"\"Rev. \"","v":"Rev. "},null,null,null,null,null,null,null,null,null,null,null,null,null,null,null,"Russell","R","Dual Speed ECM","D",4,null,"Hot Gas - 3 Pipe - Elec. Drain Pan",null,null,null,"404A","A"]
["Job Name:",null,null,null,null,null,null,null,"Job Location:",null,null,null,null,null,null,null,"Witt","W",null,null,6,null,"Hot Gas - 3 Pipe - H.G. Drain Pain",null,{"$f":"IF(OR(F14=\"AIR\",F14=\"Hot Gas - 3 Pipe - Elec. Drain Pan\",F14=\"Hot Gas - 3 Pipe - H.G. Drain Pain\",F14=\"Hot Gas - Reverse Cycle - Elec. Drain Pan\",F14=\"Hot Gas - Reverse Cycle - H.G. Drain Pain\",F14=\"Thermobank\"),\"208-230/1/60\",\"\")","v":""},"D",{"$f":"IF(Z2=\"no\",\"\",744)","v":""},"A"]
["Customer Name:",null,null,null,null,null,null,null,"Order Number:",null,null,null,null,null,null,null,"Kramer","K",null,null,null,null,"Hot Gas - Reverse Cycle - Elec. Drain Pan",null,{"$f":"IF(F14=\"ELECTRIC\",\"208-230/3/60\",\"\")","v":""},"E","407A","E"]
["Architect / Engineer:",null,null,null,null,null,null,null,"Prepared By:",null,null,null,null,null,null,null,"ColdZone","C",null,null,null,null,"Hot Gas - Reverse Cycle - H.G. Drain Pain",null,{"$f":"IF(OR(F14=\"AIR\",F14=\"Hot Gas - 3 Pipe - Elec. Drain Pan\",F14=\"Hot Gas - 3 Pipe - H.G. Drain Pain\",F14=\"Hot Gas - Reverse Cycle - Elec. Drain Pan\",F14=\"Hot Gas - Reverse Cycle - H.G. Drain Pain\",F14=\"Thermobank\"),\"460/1/60\",\"\")","v":""},"F","448A","E"]
["Unit Model Number:",null,null,null,null,{"$f":"IFERROR(R15,\"\")","v":""},null,null,"Tagging Info:",null,null,null,null,null,null,null,null,null,null,null,null,null,{"$f":"IF(A14=\"KRAMER\",\"Thermobank\",\"\")","v":"Thermobank"},null,{"$f":"IF(F14=\"ELECTRIC\",\"460/3/60\",\"\")","v":""},"G","449A","E"]
["Unit Quantity:",null,null,null,null,null,null,null,"Date:",null,null,{"$f":"TODAY()","v":"2023-09-19"},null,null,null,null,"Brand",{"$f":"Submital!A14","v":"Kramer"},"Defrost","Capacity",null,"Voltage","Motor","Refrigerant",null,null,"449B","E"]
["Select unit attributes from the application option above and the drop down menus below to build required model number",null,null,null,null,null,null,null,null,null,null,null,null,null,null,null,null,{"$f":"VLOOKUP(R11,Q6:R9,2,FALSE)","v":"K"},{"$f":"IF(AND(F14=\"Thermobank\",OR(A14=\"Russell\",A14=\"Witt\",A14=\"ColdZone\")),FALSE,IF(F14=\"Air\",\"A\",IF(F14=\"Electric\",\"E\",IF(F14=\"Hot Gas - 3 Pipe - Elec. Drain Pan\",\"H\",IF(F14=\"Hot Gas - 3 Pipe - H.G. Drain Pain\",\"K\",IF(F14=\"Hot Gas - Reverse Cycle - Elec. Drain Pan\",\"G\",IF(F14=\"Hot Gas - Reverse Cycle - H.G. Drain Pain\",\"L\",IF(Q43>=1,FALSE,\"T\"))))))))","v":"T"},{"$f":"IF(T13<100000,\"0\"&LEFT(T13,LEN(T13)-3),LEFT(T13,LEN(T13)-3))","v":{"$error":"#N/A"}},null,{"$f":"VLOOKUP(M14,Y6:Z10,2,FALSE)","v":{"$error":"#N/A"}},{"$f":"VLOOKUP(C14,S6:T8,2,FALSE)","v":{"$error":"#N/A"}},{"$f":"VLOOKUP($J$14,AA6:AB11,2,FALSE)","v":{"$error":"#N/A"}}]
["Brand",null,"Motor Type",null,"Fins/In","Defrost Type",null,null,"SST","Refrig.",{"$f":"\"R-\"&J14&\" Adjusted Capacity (BTUH) @ 10TD\"","v":"R- Adjusted Capacity (BTUH) @ 10TD"},null,"Unit Voltage",null,null,null,null,null,null,{"$f":"R35","v":{"$error":"#N/A"}}]
["Kramer",null,null,null,null,null,null,null,null,null,null,null,null,null,null,null,null,"Unit Model Num.","Lookup"]
["**clear all  fields when starting over**",null,null,null,null,null,null,null,null,null,null,null,null,null,null,null,null,{"$f":"R12&\"H\"&E14&S12&T12&V12&W12&\"A\"","v":{"$error":"#N/A"}},{"$f":"\"H\"&E14&S12&T12&V12&W12&\"A\"","v":{"$error":"#N/A"}},null,null,null,null,"Temperature"]
[null,null,null,null,null,null,null,null,null,null,null,null,null,null,null,null,null,null,null,null,null,null,null,{"$f":"VLOOKUP(S15,'SUBMITTAL DATA'!A2:AE181,9,FALSE)","v":{"$error":"#N/A"}}]
[null,null,null,null,null,null,null,null,null,null,null,null,null,null,null,null,null,null,null,"404 / 744",null,null,null,null,null,null,"HG refrigerants"]
[null,null,null,null,null,null,null,null,null,null,null,null,null,null,null,null,"HG CAP TABLE IF SELECTED","404a CAP TABLE",null,"L4E","L6E","M6A","L4P","L6P","L4R","L6R","4E","6E","6A","4P","6P","4R","6R"]
[null,null,null,null,null,null,null,null,null,null,null,null,null,null,null,1,{"$f":"ROUND((VLOOKUP(P19,$S$19:$AG$34,$R$69,FALSE)*100)*IF($U$64=1,VLOOKUP($I$14,$X$42:$Y$48,2,FALSE),1),0)","v":{"$error":"#REF!"}},{"$f":"VLOOKUP(P19,$S$19:$AG$34,$U$55,FALSE)*100","v":{"$error":"#REF!"}},1,358,331,312,358,331,358,331,411,387,366,411,387,411,387]
[null,null,null,null,null,null,null,null,null,null,null,null,null,null,null,2,{"$error":"#REF!"},{"$error":"#REF!"},2,440,445,436,440,445,440,445,508,509,511,508,509,508,509]
[null,null,null,null,null,null,null,null,null,null,null,null,null,null,null,3,{"$error":"#REF!"},{"$error":"#REF!"},3,714,538,521,714,538,714,538,830,621,619,830,621,830,621]
[null,null,null,null,null,null,null,null,null,null,null,null,null,null,null,4,{"$error":"#REF!"},{"$error":"#REF!"},4,874,664,632,874,664,874,664,1009,766,735,1009,766,1009,766]
[null,null,null,null,null,null,null,null,null,null,null,null,null,null,null,5,{"$error":"#REF!"},{"$error":"#REF!"},5,1077,894,879,1077,894,1077,894,1229,1023,1035,1229,1023,1229,1023]
[null,null,null,null,null,null,null,null,null,null,null,null,null,null,null,6,{"$error":"#REF!"},{"$error":"#REF!"},6,1319,1092,1052,1319,1092,1319,1092,1523,1257,1249,1523,1257,1523,1257]
[null,null,null,null,null,null,null,null,null,null,null,null,null,null,null,7,{"$error":"#REF!"},{"$error":"#REF!"},7,1670,1345,1325,1670,1345,1670,1345,1902,1538,1558,1902,1538,1902,1538]
[null,null,null,null,null,null,null,null,null,null,null,null,null,null,null,8,{"$error":"#REF!"},{"$error":"#REF!"},8,null,1635,"1563",null,1635,null,1635,null,"1888","1857",null,"1888",null,"1888"]
[null,null,null,null,null,null,null,null,null,null,null,null,null,null,null,9,{"$error":"#REF!"},{"$error":"#REF!"},9,null,1991,"1754",null,1991,null,1991,null,"2274","2069",null,"2274",null,"2274"]
[null,null,null,null,null,null,null,null,null,null,null,null,null,null,null,10,{"$error":"#REF!"},{"$error":"#REF!"},10,null,null,"2095",null,null,null,null,null,null,"2531"]
[null,null,null,null,null,null,null,null,null,null,null,null,null,null,null,11,{"$error":"#REF!"},{"$error":"#REF!"},11]
[null,null,null,null,null,null,null,null,null,null,null,null,null,null,null,12,{"$error":"#REF!"},{"$error":"#REF!"},12]
[null,null,"Physical Data",null,null,null,null,null,null,null,null,null,null,{"$f":"IF(I14=\"\",\"AWEF\",(IF(I14=25,\"AWEF Cooler\",\"AWEF Freezer\")))","v":"AWEF"},null,13,{"$error":"#REF!"},{"$error":"#REF!"},13]
["Base Model",null,"Fins/Inch","Refrig. Conn (ODS)",null,null,"Net Weight","Ship Weight ","Number of Fans","Air Throw","CFM","Fan Diameter",null,null,null,14,{"$error":"#REF!"},{"$error":"#REF!"},14]
[null,null,null,"Liquid","Suction","Hot Gas",null,null,null,null,null,null,null,null,null,15,{"$error":"#REF!"},{"$error":"#REF!"},15]
[{"$f":"IFERROR(\"H\"&E14&S12&T12,\"\")","v":""},null,{"$f":"IF(E14=0,\"\",E14)","v":""},{"$f":"IFERROR(VLOOKUP(S15,'SUBMITTAL DATA'!A2:AE250,21,FALSE),\"\")","v":""},{"$f":"IFERROR(VLOOKUP(S15,'SUBMITTAL DATA'!A2:AE250,22,FALSE),\"\")","v":""},{"$f":"IFERROR(VLOOKUP(S15,'SUBMITTAL DATA'!A2:AE250,23,FALSE),\"\")","v":""},{"$f":"IFERROR(VLOOKUP(S15,'SUBMITTAL DATA'!A2:AE250,28,FALSE),\"\")","v":""},{"$f":"IFERROR(VLOOKUP(S15,'SUBMITTAL DATA'!A2:AE250,29,FALSE),\"\")","v":""},{"$f":"IFERROR(VLOOKUP(S15,'SUBMITTAL DATA'!A2:AE250,5,FALSE),\"\")","v":""},{"$f":"IF(F10=\"\",\"\",\"100'\")","v":""},{"$f":"IFERROR(VLOOKUP(S15,'SUBMITTAL DATA'!A2:AE250,13,FALSE),\"\")","v":""},{"$f":"IF(F10=\"\",\"\",\"30\"\"\")","v":""},null,{"$f":"IF(I14=\"\",\"\",IFERROR(VLOOKUP(S15,'SUBMITTAL DATA'!A2:AE250,IF(I14=25,30,31),FALSE),\"\"))","v":""},null,16,{"$error":"#REF!"},{"$error":"#REF!"},16]
["Electrical Data",null,null,null,null,null,null,null,null,null,null,null,null,null,null,null,null,{"$f":"VLOOKUP(K14,$Q$19:$R$34,2,FALSE)","v":{"$error":"#N/A"}}]
["Motor Voltage",null,"Total Motor Amps",null,{"$f":"IF(Q43>=1,\"EcoNet MCA\",\"Motor Circuit MCA\")","v":"Motor Circuit MCA"},{"$f":"IF(Q43>=1,\"EcoNet MOPD\",\"Motor Circuit MOPD\")","v":"Motor Circuit MOPD"},"Heater Voltage",null,"Number of Heater Circuits","Heater Amps Each Circuit","Total Heater Amps","Heater Watts"]
[]
[{"$f":"IFERROR(VLOOKUP(S15,'SUBMITTAL DATA'!A2:AE250,14,FALSE),\"\")","v":""},null,{"$f":"IFERROR(VLOOKUP(S15,'SUBMITTAL DATA'!A2:AE250,15,FALSE),\"\")","v":""},null,{"$f":"IFERROR(VLOOKUP(S15,'SUBMITTAL DATA'!A2:AE250,IF(Q43>=1,26,24),FALSE),\"\")","v":""},{"$f":"IFERROR(VLOOKUP(S15,'SUBMITTAL DATA'!A2:AE250,IF(Q43>=1,27,25),FALSE),\"\")","v":""},{"$f":"IFERROR(VLOOKUP(S15,'SUBMITTAL DATA'!A2:AE250,16,FALSE),\"\")","v":""},null,{"$f":"IFERROR(VLOOKUP(S15,'SUBMITTAL DATA'!A2:AE250,17,FALSE),\"\")","v":""},{"$f":"IFERROR(VLOOKUP(S15,'SUBMITTAL DATA'!A2:AE250,18,FALSE),\"\")","v":""},{"$f":"IFERROR(VLOOKUP(S15,'SUBMITTAL DATA'!A2:AE250,19,FALSE),\"\")","v":""},{"$f":"IFERROR(VLOOKUP(S15,'SUBMITTAL DATA'!A2:AE250,20,FALSE),\"\")","v":""}]
[{"$f":"IF(N34=\"\",\"\",IF(N34=\"N/A\",\"PLEASE NOTE - THE SELECTED PRODUCT DOES NOT MEET AWEF REQUIREMENTS AT THE DEFINED CONDITIONS AND CANNOT BE USED FOR APPLICATIONS SMALLER THAN 3,000 SQ. FT.\",\"\"))","v":""}]
["Options (Select catalog options from drop down menu.)",null,null,null,null,null,null,null,null,null,null,null,null,null,null,null,null,null,null,null,null,null,null,null,{"$f":"IF(AND(OR(F14=W7,F14=W8,F14=W9,F14=\"Air\"),OR(J14=AA7,J14=AA8,J14=AA9,J14=AA10,J14=AA11)),AA6)","v":false}]
{"$rows_left_out":30}
{"sheet":"REVISION","index":1,"n_rows":4,"n_cols":3,"rows_kept":4,"cut":false,"hidden":true,"merged":[]}
[]
[1,"2020-07-29","intial release"]
[1.01,"2020-08-25","added notes section"]
[1.02,"2021-04-01","issued with the lookup table submittal T48:U55"]

{"sheet":"SUBMITTAL DATA","index":2,"n_rows":213,"n_cols":31,"rows_kept":213,"cut":false,"hidden":true,"merged":[]}
["GENERIC MODEL",null,"MODEL FAMILY","DEFROST TYPE","NUMBER OF FANS","MOTOR TYPE","UNIT VOLTAGE","FPI","SST","R404A CAPACITY","R407A/R448A/R449A CAPACITY",null,"CFM","MOTOR VOLTAGE","TOTAL UNIT FAN MOTOR AMPS","HEATER VOLTAGE","Number of Heater Circuits","HEATER AMPS EACH CIRCUIT","Total Heater Amps","HEATER WATTS","LIQUID LINE SIZE","SUCTION LINE SIZE","3-PIPE HG LINE","MCA - NO-ECONET","MOPD - NO-ECONET","MCA - ECONET","MOPD - ECONET","NET WEIGHT","APPROX. SHIP WEIGHT","AWEF CLR","AWEF FRZR"]
["H6A031DDA",null,"HEAVY DUTY","AIR DEFROST",1,"DUAL SPEED EC MOTOR","208-230/1/60",6,25,31200,36600,"-",5920,"208-230/1/60",6.3,"-","-","-","-","-","1/2",1.125,"-",15,20,15,20,293,470,9,"N/A"]
["H6A043DDA",null,"HEAVY DUTY","AIR DEFROST",1,"DUAL SPEED EC MOTOR","208-230/1/60",6,25,43600,51100,"-",5870,"208-230/1/60",6.3,"-","-","-","-","-","1/2",1.375,"-",15,20,15,20,293,470,9,"N/A"]
["H6A052DDA",null,"HEAVY DUTY","AIR DEFROST",1,"DUAL SPEED EC MOTOR","208-230/1/60",6,25,52100,61900,"-",5750,"208-230/1/60",6.3,"-","-","-","-","-",0.625,1.625,"-",15,20,15,20,293,470,9,"N/A"]
["H6A063DDA",null,"HEAVY DUTY","AIR DEFROST",2,"DUAL SPEED EC MOTOR","208-230/1/60",6,25,63200,73500,"-",11850,"208-230/1/60",12.6,"-","-","-","-","-",0.625,1.625,"-",15,20,16.2,20,489,730,9,"N/A"]
["H6A087DDA",null,"HEAVY DUTY","AIR DEFROST",2,"DUAL SPEED EC MOTOR","208-230/1/60",6,25,87900,103500,"-",11730,"208-230/1/60",12.6,"-","-","-","-","-",0.875,2.125,"-",15,20,16.2,20,489,730,9,"N/A"]
["H6A105DDA",null,"HEAVY DUTY","AIR DEFROST",2,"DUAL SPEED EC MOTOR","208-230/1/60",6,25,105200,124900,"-",11500,"208-230/1/60",12.6,"-","-","-","-","-",0.875,2.125,"-",15,20,16.2,20,489,730,9,"N/A"]
["H6A132DDA",null,"HEAVY DUTY","AIR DEFROST",3,"DUAL SPEED EC MOTOR","208-230/1/60",6,25,132500,155800,"-",17600,"208-230/1/60",18.899999999999999,"-","-","-","-","-",0.875,2.125,"-",20.5,25,22.5,25,652,1000,9,"N/A"]
["H6A156DDA",null,"HEAVY DUTY","AIR DEFROST",3,"DUAL SPEED EC MOTOR","208-230/1/60",6,25,156300,185700,"-",17250,"208-230/1/60",18.899999999999999,"-","-","-","-","-",1.125,2.125,"-",20.5,25,22.5,25,652,1000,9,"N/A"]
["H6A175DDA",null,"HEAVY DUTY","AIR DEFROST",4,"DUAL SPEED EC MOTOR","208-230/1/60",6,25,175400,206900,"-",23460,"208-230/1/60",25.2,"-","-","-","-","-",1.125,2.125,"-",26.8,30,28.8,30,837,1130,9,"N/A"]
["H6A209DDA",null,"HEAVY DUTY","AIR DEFROST",4,"DUAL SPEED EC MOTOR","208-230/1/60",6,25,209500,253100,"-",23000,"208-230/1/60",25.2,"-","-","-","-","-",1.125,2.125,"-",26.8,30,28.8,30,837,1130,9,"N/A"]
["H6A031FDA",null,"HEAVY DUTY","AIR DEFROST",1,"DUAL SPEED EC MOTOR","460/1/60",6,25,31200,36600,"-",5920,"460/1/60",3.1,"-","-","-","-","-","1/2",1.125,"-",15,20,15,20,293,470,9,"N/A"]
["H6A043FDA",null,"HEAVY DUTY","AIR DEFROST",1,"DUAL SPEED EC MOTOR","460/1/60",6,25,43600,51100,"-",5870,"460/1/60",3.1,"-","-","-","-","-","1/2",1.375,"-",15,20,15,20,293,470,9,"N/A"]
["H6A052FDA",null,"HEAVY DUTY","AIR DEFROST",1,"DUAL SPEED EC MOTOR","460/1/60",6,25,52100,61900,"-",5750,"460/1/60",3.1,"-","-","-","-","-",0.625,1.625,"-",15,20,15,20,293,470,9,"N/A"]
["H6A063FDA",null,"HEAVY DUTY","AIR DEFROST",2,"DUAL SPEED EC MOTOR","460/1/60",6,25,63200,73500,"-",11850,"460/1/60",6.2,"-","-","-","-","-",0.625,1.625,"-",15,20,15,20,489,730,9,"N/A"]
["H6A087FDA",null,"HEAVY DUTY","AIR DEFROST",2,"DUAL SPEED EC MOTOR","460/1/60",6,25,87900,103500,"-",11730,"460/1/60",6.2,"-","-","-","-","-",0.875,2.125,"-",15,20,15,20,489,730,9,"N/A"]
["H6A105FDA",null,"HEAVY DUTY","AIR DEFROST",2,"DUAL SPEED EC MOTOR","460/1/60",6,25,105200,124900,"-",11500,"460/1/60",6.2,"-","-","-","-","-",0.875,2.125,"-",15,20,15,20,489,730,9,"N/A"]
["H6A132FDA",null,"HEAVY DUTY","AIR DEFROST",3,"DUAL SPEED EC MOTOR","460/1/60",6,25,132500,155800,"-",17600,"460/1/60",9.3000000000000007,"-","-","-","-","-",0.875,2.125,"-",15,20,15,20,652,1000,9,"N/A"]
["H6A156FDA",null,"HEAVY DUTY","AIR DEFROST",3,"DUAL SPEED EC MOTOR","460/1/60",6,25,156300,185700,"-",17250,"460/1/60",9.3000000000000007,"-","-","-","-","-",1.125,2.125,"-",15,20,15,20,652,1000,9,"N/A"]
["H6A175FDA",null,"HEAVY DUTY","AIR DEFROST",4,"DUAL SPEED EC MOTOR","460/1/60",6,25,175400,206900,"-",23460,"460/1/60",12.4,"-","-","-","-","-",1.125,2.125,"-",15,20,15,20,837,1130,9,"N/A"]
["H6A209FDA",null,"HEAVY DUTY","AIR DEFROST",4,"DUAL SPEED EC MOTOR","460/1/60",6,25,209500,253100,"-",23000,"460/1/60",12.4,"-","-","-","-","-",1.125,2.125,"-",15,20,15,20,837,1130,9,"N/A"]
["H6E033EDA",null,"HEAVY DUTY","ELECTRIC DEFROST",1,"DUAL SPEED EC MOTOR","208-230/3/60",6,-20,33100,38700,"-",5920,"208-230/1/60",6.3,"208-230/3/60",1,14.4,14.4,6000,0.5,2.125,"-",15,20,16.399999999999999,20,293,470,9,4.1500000000000004]
["H6E044EDA",null,"HEAVY DUTY","ELECTRIC DEFROST",1,"DUAL SPEED EC MOTOR","208-230/3/60",6,-20,44500,50900,"-",5870,"208-230/1/60",6.3,"208-230/3/60",1,14.4,14.4,6000,0.625,2.125,"-",15,20,16.399999999999999,20,293,470,9,4.1500000000000004]
["H6E053EDA",null,"HEAVY DUTY","ELECTRIC DEFROST",1,"DUAL SPEED EC MOTOR","208-230/3/60",6,-20,53800,62100,"-",5750,"208-230/1/60",6.3,"208-230/3/60",1,14.4,14.4,6000,0.625,2.125,"-",15,20,16.399999999999999,20,293,470,9,4.1500000000000004]
["H6E066EDA",null,"HEAVY DUTY","ELECTRIC DEFROST",2,"DUAL SPEED EC MOTOR","208-230/3/60",6,-20,66400,76600,"-",11850,"208-230/1/60",12.6,"208-230/3/60",1,28.9,28.9,12000,0.625,2.125,"-",15,20,30.9,35,489,730,9,4.1500000000000004]
["H6E089EDA",null,"HEAVY DUTY","ELECTRIC DEFROST",2,"DUAL SPEED EC MOTOR","208-230/3/60",6,-20,89400,102300,"-",11730,"208-230/1/60",12.6,"208-230/3/60",1,28.9,28.9,12000,0.875,3.125,"-",15,20,30.9,35,489,730,9,4.1500000000000004]
["H6E109EDA",null,"HEAVY DUTY","ELECTRIC DEFROST",2,"DUAL SPEED EC MOTOR","208-230/3/60",6,-20,109200,125700,"-",11500,"208-230/1/60",12.6,"208-230/3/60",1,28.9,28.9,12000,0.875,3.125,"-",15,20,30.9,35,489,730,9,4.1500000000000004]
["H6E134EDA",null,"HEAVY DUTY","ELECTRIC DEFROST",3,"DUAL SPEED EC MOTOR","208-230/3/60",6,-20,134500,153800,"-",17600,"208-230/1/60",18.899999999999999,"208-230/3/60",1,43.3,43.3,18000,1.125,3.125,"-",20.5,25,45.3,50,652,1000,9,4.1500000000000004]
["H6E163EDA",null,"HEAVY DUTY","ELECTRIC DEFROST",3,"DUAL SPEED EC MOTOR","208-230/3/60",6,-20,163500,188800,"-",17250,"208-230/1/60",18.899999999999999,"208-230/3/60",1,43.3,43.3,18000,1.125,3.125,"-",20.5,25,45.3,50,652,1000,9,4.1500000000000004]
["H6E199EDA",null,"HEAVY DUTY","ELECTRIC DEFROST",4,"DUAL SPEED EC MOTOR","208-230/3/60",6,-20,199100,227400,"-",23000,"208-230/1/60",25.2,"208-230/3/60",2,28.9,57.7,24000,1.125,3.125,"-",26.8,30,59.7,60,837,1130,9,4.1500000000000004]
["H4E035EDA",null,"HEAVY DUTY","ELECTRIC DEFROST",1,"DUAL SPEED EC MOTOR","208-230/3/60",4,-20,35800,41100,"-",5870,"208-230/1/60",6.3,"208-230/3/60",1,14.4,14.4,6000,0.5,2.125,"-",15,20,16.399999999999999,20,293,470,"N/A",4.1500000000000004]
["H4E044EDA",null,"HEAVY DUTY","ELECTRIC DEFROST",1,"DUAL SPEED EC MOTOR","208-230/3/60",4,-20,44000,50800,"-",5750,"208-230/1/60",6.3,"208-230/3/60",1,14.4,14.4,6000,0.625,2.125,"-",15,20,16.399999999999999,20,293,470,"N/A",4.1500000000000004]
["H4E071EDA",null,"HEAVY DUTY","ELECTRIC DEFROST",2,"DUAL SPEED EC MOTOR","208-230/3/60",4,-20,71400,83000,"-",11730,"208-230/1/60",12.6,"208-230/3/60",1,28.9,28.9,12000,0.625,2.125,"-",15,20,30.9,35,489,730,"N/A",4.1500000000000004]
["H4E087EDA",null,"HEAVY DUTY","ELECTRIC DEFROST",2,"DUAL SPEED EC MOTOR","208-230/3/60",4,-20,87400,100900,"-",11500,"208-230/1/60",12.6,"208-230/3/60",1,28.9,28.9,12000,0.875,3.125,"-",15,20,30.9,35,489,730,"N/A",4.1500000000000004]
["H4E107EDA",null,"HEAVY DUTY","ELECTRIC DEFROST",3,"DUAL SPEED EC MOTOR","208-230/3/60",4,-20,107700,122900,"-",17600,"208-230/1/60",18.899999999999999,"208-230/3/60",1,43.3,43.3,18000,0.875,3.125,"-",20.5,25,45.3,50,652,1000,"N/A",4.1500000000000004]
["H4E131EDA",null,"HEAVY DUTY","ELECTRIC DEFROST",3,"DUAL SPEED EC MOTOR","208-230/3/60",4,-20,131900,152300,"-",17250,"208-230/1/60",18.899999999999999,"208-230/3/60",1,43.3,43.3,18000,1.125,3.125,"-",20.5,25,45.3,50,652,1000,"N/A",4.1500000000000004]
["H4E167EDA",null,"HEAVY DUTY","ELECTRIC DEFROST",4,"DUAL SPEED EC MOTOR","208-230/3/60",4,-20,167000,190200,"-",23000,"208-230/1/60",25.2,"208-230/3/60",2,28.9,57.7,24000,1.125,3.125,"-",26.8,30,59.7,60,837,1130,"N/A",4.1500000000000004]
["H6E033GDA",null,"HEAVY DUTY","ELECTRIC DEFROST",1,"DUAL SPEED EC MOTOR","460/3/60",6,-20,33100,38700,"-",5920,"460/1/60",3.1,"460/3/60",1,7.5,7.5,6000,0.5,2.125,"-",15,20,15,20,293,470,9,4.1500000000000004]
["H6E044GDA",null,"HEAVY DUTY","ELECTRIC DEFROST",1,"DUAL SPEED EC MOTOR","460/3/60",6,-20,44500,50900,"-",5870,"460/1/60",3.1,"460/3/60",1,7.5,7.5,6000,0.625,2.125,"-",15,20,15,20,293,470,9,4.1500000000000004]
["H6E053GDA",null,"HEAVY DUTY","ELECTRIC DEFROST",1,"DUAL SPEED EC MOTOR","460/3/60",6,-20,53800,62100,"-",5750,"460/1/60",3.1,"460/3/60",1,7.5,7.5,6000,0.625,2.125,"-",15,20,15,20,293,470,9,4.1500000000000004]
{"$rows_left_out":174}
{"sheet":"All Temp Options","index":3,"n_rows":28,"n_cols":5,"rows_kept":28,"cut":false,"hidden":true,"merged":[]}
[]
[]
[]
[]
[]
[]
[]
[]
[null,null,"Generic Option Name"]
[null,null,{"$f":"IF(OR(Submital!F14=\"Hot Gas - 3 Pipe - Elec. Drain Pan\",Submital!F14=\"Hot Gas - 3 Pipe - H.G. Drain Pain\",Submital!F14=\"Hot Gas - Reverse Cycle - Elec. Drain Pan\",Submital!F14=\"Hot Gas - Reverse Cycle - H.G. Drain Pain\",Submital!F14=\"Thermobank\"),\"\",\"EcoNet\")","v":"EcoNet"}]
[null,null,{"$f":"IF(OR(Submital!F14=\"Hot Gas - 3 Pipe - Elec. Drain Pan\",Submital!F14=\"Hot Gas - 3 Pipe - H.G. Drain Pain\",Submital!F14=\"Hot Gas - Reverse Cycle - Elec. Drain Pan\",Submital!F14=\"Hot Gas - Reverse Cycle - H.G. Drain Pain\",Submital!F14=\"Thermobank\"),\"\",\"EcoNet Command Center - Loose\")","v":"EcoNet Command Center - Loose"}]
[null,null,"Mechanical Thermostat - Mounted",null,"Hot Gas - 3 Pipe"]
[null,null,"Electronic Room Thermostat - Mounted",null,"Hot Gas - Reverse Cycle"]
[null,null,"Thermostatic Expanion Valve - Mounted"]
[null,null,"Electronic Expansion Valve - Mounted"]
[null,null,"Liquid Line Solenoid Valve - Mounted"]
[null,null,"Mechanical Thermostat - Loose"]
[null,null,"Electronic Room Thermostat - Loose"]
[null,null,"Thermostatic Expansion Valve - Loose"]
[null,null,"Electronic Expanison Valve - Loose"]
[null,null,"Liquid Line Solenoid Valve - Loose"]
[null,null,"Heat Exchanger HX-25 - Loose"]
[null,null,"Heat Exchanger HX-50 - Loose"]
[null,null,"Heat Exchanger HX-75 - Loose"]
[null,null,"Heat Exchanger HX-100 - Loose"]
[null,null,"Heat Exchanger HX-150 - Loose"]
[null,null,"Heat Exchanger HX-250 - Loose"]
[null,null,"Heat Exchanger HX-350 - Loose"]

{"sheet":"Pics","index":4,"n_rows":22,"n_cols":5,"rows_kept":22,"cut":false,"hidden":true,"merged":[]}
["H"]
[]
[]
[null,null,1]
[null,null,2]
[null,null,3]
[null,null,4]
[]
[]
[]
[]
[]
[]
[]
[]
[]
[]
[]
[null,null,null,null,"Russell"]
[null,null,null,null,"Witt"]
[null,null,null,null,"Kramer"]
[null,null,null,null,"ColdZone"]